hadoop-yarn-issues mailing list archives

Site index · List index
Message view « Date » · « Thread »
Top « Date » · « Thread »
From "Tsuyoshi OZAWA (JIRA)" <j...@apache.org>
Subject [jira] [Updated] (YARN-1468) TestRMRestart.testRMRestartWaitForPreviousAMToFinish get failed.
Date Tue, 03 Dec 2013 11:55:40 GMT

     [ https://issues.apache.org/jira/browse/YARN-1468?page=com.atlassian.jira.plugin.system.issuetabpanels:all-tabpanel
]

Tsuyoshi OZAWA updated YARN-1468:
---------------------------------

    Description: 
Log is as following:
{code}
Tests run: 13, Failures: 1, Errors: 0, Skipped: 0, Time elapsed: 149.968 sec <<<
FAILURE! - in org.apache.hadoop.yarn.server.resourcemanager.TestRMRestart
testRMRestartWaitForPreviousAMToFinish(org.apache.hadoop.yarn.server.resourcemanager.TestRMRestart)
 Time elapsed: 44.197 sec  <<< FAILURE!
junit.framework.AssertionFailedError: AppAttempt state is not correct (timedout) expected:<ALLOCATED>
but was:<SCHEDULED>
        at junit.framework.Assert.fail(Assert.java:50)
        at junit.framework.Assert.failNotEquals(Assert.java:287)
        at junit.framework.Assert.assertEquals(Assert.java:67)
        at org.apache.hadoop.yarn.server.resourcemanager.MockAM.waitForState(MockAM.java:82)
        at org.apache.hadoop.yarn.server.resourcemanager.MockRM.sendAMLaunched(MockRM.java:292)
        at org.apache.hadoop.yarn.server.resourcemanager.TestRMRestart.launchAM(TestRMRestart.java:826)
        at org.apache.hadoop.yarn.server.resourcemanager.TestRMRestart.testRMRestartWaitForPreviousAMToFinish(TestRMRestart.java:464)
{code}



  was:
Log is as following:
{code}
Tests run: 13, Failures: 1, Errors: 0, Skipped: 0, Time elapsed: 149.968 sec <<<
FAILURE! - in org.apache.hadoop.yarn.server.resourcemanager.TestRMRestart
testRMRestartWaitForPreviousAMToFinish(org.apache.hadoop.yarn.server.resourcemanager.TestRMRestart)
 Time elapsed: 44.197 sec  <<< FAILURE!
junit.framework.AssertionFailedError: AppAttempt state is not correct (timedout) expected:<ALLOCATED>
but was:<SCHEDULED>
        at junit.framework.Assert.fail(Assert.java:50)
        at junit.framework.Assert.failNotEquals(Assert.java:287)
        at junit.framework.Assert.assertEquals(Assert.java:67)
        at org.apache.hadoop.yarn.server.resourcemanager.MockAM.waitForState(MockAM.java:82)
        at org.apache.hadoop.yarn.server.resourcemanager.MockRM.sendAMLaunched(MockRM.java:292)
        at org.apache.hadoop.yarn.server.resourcemanager.TestRMRestart.launchAM(TestRMRestart.java:826)
        at org.apache.hadoop.yarn.server.resourcemanager.TestRMRestart.testRMRestartWaitForPreviousAMToFinish(TestRMRestart.java:464)
{code}

Another log is as following:
{code}
Tests run: 13, Failures: 1, Errors: 0, Skipped: 0, Time elapsed: 143.009 sec <<<
FAILURE! - in org.apache.hadoop.yarn.server.resourcemanager.TestRMRestart
testRMDelegationTokenRestoredOnRMRestart(org.apache.hadoop.yarn.server.resourcemanager.TestRMRestart)
 Time elapsed: 2.077 sec  <<< FAILURE!
java.lang.AssertionError: null
	at org.junit.Assert.fail(Assert.java:92)
	at org.junit.Assert.assertTrue(Assert.java:43)
	at org.junit.Assert.assertTrue(Assert.java:54)
	at org.apache.hadoop.yarn.server.resourcemanager.TestRMRestart.testRMDelegationTokenRestoredOnRMRestart(TestRMRestart.java:1259)
{code}


> TestRMRestart.testRMRestartWaitForPreviousAMToFinish get failed.
> ----------------------------------------------------------------
>
>                 Key: YARN-1468
>                 URL: https://issues.apache.org/jira/browse/YARN-1468
>             Project: Hadoop YARN
>          Issue Type: Bug
>          Components: resourcemanager
>            Reporter: Junping Du
>            Priority: Critical
>
> Log is as following:
> {code}
> Tests run: 13, Failures: 1, Errors: 0, Skipped: 0, Time elapsed: 149.968 sec <<<
FAILURE! - in org.apache.hadoop.yarn.server.resourcemanager.TestRMRestart
> testRMRestartWaitForPreviousAMToFinish(org.apache.hadoop.yarn.server.resourcemanager.TestRMRestart)
 Time elapsed: 44.197 sec  <<< FAILURE!
> junit.framework.AssertionFailedError: AppAttempt state is not correct (timedout) expected:<ALLOCATED>
but was:<SCHEDULED>
>         at junit.framework.Assert.fail(Assert.java:50)
>         at junit.framework.Assert.failNotEquals(Assert.java:287)
>         at junit.framework.Assert.assertEquals(Assert.java:67)
>         at org.apache.hadoop.yarn.server.resourcemanager.MockAM.waitForState(MockAM.java:82)
>         at org.apache.hadoop.yarn.server.resourcemanager.MockRM.sendAMLaunched(MockRM.java:292)
>         at org.apache.hadoop.yarn.server.resourcemanager.TestRMRestart.launchAM(TestRMRestart.java:826)
>         at org.apache.hadoop.yarn.server.resourcemanager.TestRMRestart.testRMRestartWaitForPreviousAMToFinish(TestRMRestart.java:464)
> {code}



--
This message was sent by Atlassian JIRA
(v6.1#6144)

Mime
View raw message