hadoop-yarn-issues mailing list archives

Site index · List index
Message view « Date » · « Thread »
Top « Date » · « Thread »
From "Hadoop QA (JIRA)" <j...@apache.org>
Subject [jira] [Commented] (YARN-1450) TestUnmanagedAMLauncher#testDSShell fails on trunk
Date Thu, 28 Nov 2013 03:38:36 GMT

    [ https://issues.apache.org/jira/browse/YARN-1450?page=com.atlassian.jira.plugin.system.issuetabpanels:comment-tabpanel&focusedCommentId=13834496#comment-13834496
] 

Hadoop QA commented on YARN-1450:
---------------------------------

{color:red}-1 overall{color}.  Here are the results of testing the latest attachment 
  http://issues.apache.org/jira/secure/attachment/12616189/YARN-1450.v3.patch
  against trunk revision .

    {color:green}+1 @author{color}.  The patch does not contain any @author tags.

    {color:red}-1 tests included{color}.  The patch doesn't appear to include any new or modified
tests.
                        Please justify why no new tests are needed for this patch.
                        Also please list what manual steps were performed to verify this patch.

    {color:green}+1 javac{color}.  The applied patch does not increase the total number of
javac compiler warnings.

    {color:green}+1 javadoc{color}.  The javadoc tool did not generate any warning messages.

    {color:green}+1 eclipse:eclipse{color}.  The patch built with eclipse:eclipse.

    {color:green}+1 findbugs{color}.  The patch does not introduce any new Findbugs (version
1.3.9) warnings.

    {color:green}+1 release audit{color}.  The applied patch does not increase the total number
of release audit warnings.

    {color:green}+1 core tests{color}.  The patch passed unit tests in hadoop-yarn-project/hadoop-yarn/hadoop-yarn-applications/hadoop-yarn-applications-distributedshell.

    {color:green}+1 contrib tests{color}.  The patch passed contrib unit tests.

Test results: https://builds.apache.org/job/PreCommit-YARN-Build/2559//testReport/
Console output: https://builds.apache.org/job/PreCommit-YARN-Build/2559//console

This message is automatically generated.

> TestUnmanagedAMLauncher#testDSShell fails on trunk
> --------------------------------------------------
>
>                 Key: YARN-1450
>                 URL: https://issues.apache.org/jira/browse/YARN-1450
>             Project: Hadoop YARN
>          Issue Type: Bug
>          Components: applications/distributed-shell
>            Reporter: Akira AJISAKA
>            Assignee: Binglin Chang
>         Attachments: YARN-1450.v1.patch, YARN-1450.v2.patch, YARN-1450.v3.patch, org.apache.hadoop.yarn.applications.unmanagedamlauncher.TestUnmanagedAMLauncher-output.txt,
org.apache.hadoop.yarn.applications.unmanagedamlauncher.TestUnmanagedAMLauncher.txt
>
>
> TestUnmanagedAMLauncher fails on trunk. The console output is
> {code}
> Running org.apache.hadoop.yarn.applications.unmanagedamlauncher.TestUnmanagedAMLauncher
> Tests run: 2, Failures: 0, Errors: 1, Skipped: 0, Time elapsed: 35.937 sec <<<
FAILURE! - in org.apache.hadoop.yarn.applications.unmanagedamlauncher.TestUnmanagedAMLauncher
> testDSShell(org.apache.hadoop.yarn.applications.unmanagedamlauncher.TestUnmanagedAMLauncher)
 Time elapsed: 14.558 sec  <<< ERROR!
> java.lang.RuntimeException: Failed to receive final expected state in ApplicationReport,
CurrentState=ACCEPTED, ExpectedStates=FINISHED,FAILED,KILLED
> 	at org.apache.hadoop.yarn.applications.unmanagedamlauncher.UnmanagedAMLauncher.monitorApplication(UnmanagedAMLauncher.java:447)
> 	at org.apache.hadoop.yarn.applications.unmanagedamlauncher.UnmanagedAMLauncher.run(UnmanagedAMLauncher.java:352)
> 	at org.apache.hadoop.yarn.applications.unmanagedamlauncher.TestUnmanagedAMLauncher.testDSShell(TestUnmanagedAMLauncher.java:145)
> {code}



--
This message was sent by Atlassian JIRA
(v6.1#6144)

Mime
View raw message