hadoop-yarn-issues mailing list archives

Site index · List index
Message view « Date » · « Thread »
Top « Date » · « Thread »
From "Akira AJISAKA (JIRA)" <j...@apache.org>
Subject [jira] [Created] (YARN-1450) TestUnmanagedAMLauncher#testDSShell fails on trunk
Date Tue, 26 Nov 2013 04:24:35 GMT
Akira AJISAKA created YARN-1450:
-----------------------------------

             Summary: TestUnmanagedAMLauncher#testDSShell fails on trunk
                 Key: YARN-1450
                 URL: https://issues.apache.org/jira/browse/YARN-1450
             Project: Hadoop YARN
          Issue Type: Bug
          Components: applications
            Reporter: Akira AJISAKA
             Fix For: 3.0.0


TestUnmanagedAMLauncher fails on trunk. The console output is
{code}
Running org.apache.hadoop.yarn.applications.unmanagedamlauncher.TestUnmanagedAMLauncher
Tests run: 2, Failures: 0, Errors: 1, Skipped: 0, Time elapsed: 35.937 sec <<< FAILURE!
- in org.apache.hadoop.yarn.applications.unmanagedamlauncher.TestUnmanagedAMLauncher
testDSShell(org.apache.hadoop.yarn.applications.unmanagedamlauncher.TestUnmanagedAMLauncher)
 Time elapsed: 14.558 sec  <<< ERROR!
java.lang.RuntimeException: Failed to receive final expected state in ApplicationReport, CurrentState=ACCEPTED,
ExpectedStates=FINISHED,FAILED,KILLED
	at org.apache.hadoop.yarn.applications.unmanagedamlauncher.UnmanagedAMLauncher.monitorApplication(UnmanagedAMLauncher.java:447)
	at org.apache.hadoop.yarn.applications.unmanagedamlauncher.UnmanagedAMLauncher.run(UnmanagedAMLauncher.java:352)
	at org.apache.hadoop.yarn.applications.unmanagedamlauncher.TestUnmanagedAMLauncher.testDSShell(TestUnmanagedAMLauncher.java:145)
{code}



--
This message was sent by Atlassian JIRA
(v6.1#6144)

Mime
View raw message