hadoop-yarn-issues mailing list archives

Site index · List index
Message view « Date » · « Thread »
Top « Date » · « Thread »
From "Chris Nauroth (JIRA)" <j...@apache.org>
Subject [jira] [Commented] (YARN-700) TestInfoBlock fails on Windows because of line ending missmatch
Date Tue, 21 May 2013 00:13:17 GMT

    [ https://issues.apache.org/jira/browse/YARN-700?page=com.atlassian.jira.plugin.system.issuetabpanels:comment-tabpanel&focusedCommentId=13662494#comment-13662494
] 

Chris Nauroth commented on YARN-700:
------------------------------------

+1 for the patch.  I verified that the test passes on Mac and Windows.  Thank you, Ivan!
                
> TestInfoBlock fails on Windows because of line ending missmatch
> ---------------------------------------------------------------
>
>                 Key: YARN-700
>                 URL: https://issues.apache.org/jira/browse/YARN-700
>             Project: Hadoop YARN
>          Issue Type: Bug
>    Affects Versions: 3.0.0
>            Reporter: Ivan Mitic
>            Assignee: Ivan Mitic
>         Attachments: YARN-700.patch
>
>
> Exception:
> {noformat}
> Running org.apache.hadoop.yarn.webapp.view.TestInfoBlock
> Tests run: 1, Failures: 1, Errors: 0, Skipped: 0, Time elapsed: 0.962 sec <<<
FAILURE!
> testMultilineInfoBlock(org.apache.hadoop.yarn.webapp.view.TestInfoBlock)  Time elapsed:
873 sec  <<< FAILURE!
> java.lang.AssertionError: 
> 	at org.junit.Assert.fail(Assert.java:91)
> 	at org.junit.Assert.assertTrue(Assert.java:43)
> 	at org.junit.Assert.assertTrue(Assert.java:54)
> 	at org.apache.hadoop.yarn.webapp.view.TestInfoBlock.testMultilineInfoBlock(TestInfoBlock.java:79)
> 	at sun.reflect.NativeMethodAccessorImpl.invoke0(Native Method)
> 	at sun.reflect.NativeMethodAccessorImpl.invoke(NativeMethodAccessorImpl.java:39)
> 	at sun.reflect.DelegatingMethodAccessorImpl.invoke(DelegatingMethodAccessorImpl.java:25)
> 	at java.lang.reflect.Method.invoke(Method.java:597)
> 	at org.junit.runners.model.FrameworkMethod$1.runReflectiveCall(FrameworkMethod.java:44)
> 	at org.junit.internal.runners.model.ReflectiveCallable.run(ReflectiveCallable.java:15)
> 	at org.junit.runners.model.FrameworkMethod.invokeExplosively(FrameworkMethod.java:41)
> 	at org.junit.internal.runners.statements.InvokeMethod.evaluate(InvokeMethod.java:20)
> 	at org.junit.internal.runners.statements.FailOnTimeout$1.run(FailOnTimeout.java:28)
> {noformat}

--
This message is automatically generated by JIRA.
If you think it was sent incorrectly, please contact your JIRA administrators
For more information on JIRA, see: http://www.atlassian.com/software/jira

Mime
View raw message