hadoop-yarn-issues mailing list archives

Site index · List index
Message view « Date » · « Thread »
Top « Date » · « Thread »
From "Hudson (JIRA)" <j...@apache.org>
Subject [jira] [Commented] (YARN-30) TestNMWebServicesApps, TestRMWebServicesApps and TestRMWebServicesNodes fail on jdk7
Date Tue, 09 Oct 2012 23:14:03 GMT

    [ https://issues.apache.org/jira/browse/YARN-30?page=com.atlassian.jira.plugin.system.issuetabpanels:comment-tabpanel&focusedCommentId=13472848#comment-13472848
] 

Hudson commented on YARN-30:
----------------------------

Integrated in Hadoop-Common-trunk-Commit #2838 (See [https://builds.apache.org/job/Hadoop-Common-trunk-Commit/2838/])
    YARN-30. Fixed tests verifying web-services to work on JDK7. Contributed by Thomas Graves.
(Revision 1396391)

     Result = SUCCESS
vinodkv : http://svn.apache.org/viewcvs.cgi/?root=Apache-SVN&view=rev&rev=1396391
Files : 
* /hadoop/common/trunk/hadoop-yarn-project/CHANGES.txt
* /hadoop/common/trunk/hadoop-yarn-project/hadoop-yarn/hadoop-yarn-common/src/test/java/org/apache/hadoop/yarn/webapp/WebServicesTestUtils.java
* /hadoop/common/trunk/hadoop-yarn-project/hadoop-yarn/hadoop-yarn-server/hadoop-yarn-server-nodemanager/src/test/java/org/apache/hadoop/yarn/server/nodemanager/webapp/TestNMWebServicesApps.java
* /hadoop/common/trunk/hadoop-yarn-project/hadoop-yarn/hadoop-yarn-server/hadoop-yarn-server-resourcemanager/src/test/java/org/apache/hadoop/yarn/server/resourcemanager/webapp/TestRMWebServicesApps.java
* /hadoop/common/trunk/hadoop-yarn-project/hadoop-yarn/hadoop-yarn-server/hadoop-yarn-server-resourcemanager/src/test/java/org/apache/hadoop/yarn/server/resourcemanager/webapp/TestRMWebServicesNodes.java

                
> TestNMWebServicesApps, TestRMWebServicesApps and TestRMWebServicesNodes fail on jdk7
> ------------------------------------------------------------------------------------
>
>                 Key: YARN-30
>                 URL: https://issues.apache.org/jira/browse/YARN-30
>             Project: Hadoop YARN
>          Issue Type: Bug
>    Affects Versions: 2.0.2-alpha, 0.23.3
>            Reporter: Thomas Graves
>            Assignee: Thomas Graves
>              Labels: java7
>             Fix For: 2.0.3-alpha, 0.23.5
>
>         Attachments: YARN-30.1.patch, YARN-30-branch23.patch, YARN-30.patch, YARN-30.patch,
YARN-30.patch
>
>
> It looks like the string changed from "const class" to "constant". 
> Tests run: 19, Failures: 3, Errors: 0, Skipped: 0, Time elapsed: 6.786 sec <<<
FAILURE!
> testNodeAppsStateInvalid(org.apache.hadoop.yarn.server.nodemanager.webapp.TestNMWebServicesApps)
 Time elapsed: 0.248 sec  <<< FAILURE!
> java.lang.AssertionError: exception message doesn't match, got: No enum constant org.apache.hadoop.yarn.server.nodemanager.containermanager.application.ApplicationState.FOO_STATE
expected: No enum const class org.apache.hadoop.yarn.server.nodemanager.containermanager.application.ApplicationState.FOO_STATE

--
This message is automatically generated by JIRA.
If you think it was sent incorrectly, please contact your JIRA administrators
For more information on JIRA, see: http://www.atlassian.com/software/jira

Mime
View raw message