hadoop-yarn-issues mailing list archives

Site index · List index
Message view « Date » · « Thread »
Top « Date » · « Thread »
From "Thomas Graves (JIRA)" <j...@apache.org>
Subject [jira] [Updated] (YARN-30) TestNMWebServicesApps, TestRMWebServicesApps and TestRMWebServicesNodes fail on jdk7
Date Mon, 20 Aug 2012 19:31:38 GMT

     [ https://issues.apache.org/jira/browse/YARN-30?page=com.atlassian.jira.plugin.system.issuetabpanels:all-tabpanel
]

Thomas Graves updated YARN-30:
------------------------------

    Attachment: YARN-30.patch

this is ready for review.
                
> TestNMWebServicesApps, TestRMWebServicesApps and TestRMWebServicesNodes fail on jdk7
> ------------------------------------------------------------------------------------
>
>                 Key: YARN-30
>                 URL: https://issues.apache.org/jira/browse/YARN-30
>             Project: Hadoop YARN
>          Issue Type: Bug
>    Affects Versions: 0.23.3
>            Reporter: Thomas Graves
>            Assignee: Thomas Graves
>              Labels: java7
>         Attachments: YARN-30.patch
>
>
> It looks like the string changed from "const class" to "constant". 
> Tests run: 19, Failures: 3, Errors: 0, Skipped: 0, Time elapsed: 6.786 sec <<<
FAILURE!
> testNodeAppsStateInvalid(org.apache.hadoop.yarn.server.nodemanager.webapp.TestNMWebServicesApps)
 Time elapsed: 0.248 sec  <<< FAILURE!
> java.lang.AssertionError: exception message doesn't match, got: No enum constant org.apache.hadoop.yarn.server.nodemanager.containermanager.application.ApplicationState.FOO_STATE
expected: No enum const class org.apache.hadoop.yarn.server.nodemanager.containermanager.application.ApplicationState.FOO_STATE

--
This message is automatically generated by JIRA.
If you think it was sent incorrectly, please contact your JIRA administrators: https://issues.apache.org/jira/secure/ContactAdministrators!default.jspa
For more information on JIRA, see: http://www.atlassian.com/software/jira

        

Mime
View raw message