hadoop-yarn-dev mailing list archives

Site index · List index
Message view « Date » · « Thread »
Top « Date » · « Thread »
From "Jason Lowe (JIRA)" <j...@apache.org>
Subject [jira] [Created] (YARN-7299) TestDistributedScheduler is failing
Date Mon, 09 Oct 2017 16:31:02 GMT
Jason Lowe created YARN-7299:
--------------------------------

             Summary: TestDistributedScheduler is failing
                 Key: YARN-7299
                 URL: https://issues.apache.org/jira/browse/YARN-7299
             Project: Hadoop YARN
          Issue Type: Bug
            Reporter: Jason Lowe


TestDistributedScheduler has been failing consistently in trunk:
{noformat}
Running org.apache.hadoop.yarn.server.nodemanager.scheduler.TestDistributedScheduler
Tests run: 1, Failures: 1, Errors: 0, Skipped: 0, Time elapsed: 0.75 sec <<< FAILURE!
- in org.apache.hadoop.yarn.server.nodemanager.scheduler.TestDistributedScheduler
testDistributedScheduler(org.apache.hadoop.yarn.server.nodemanager.scheduler.TestDistributedScheduler)
 Time elapsed: 0.67 sec  <<< FAILURE!
java.lang.AssertionError: expected:<4> but was:<2>
	at org.junit.Assert.fail(Assert.java:88)
	at org.junit.Assert.failNotEquals(Assert.java:743)
	at org.junit.Assert.assertEquals(Assert.java:118)
	at org.junit.Assert.assertEquals(Assert.java:555)
	at org.junit.Assert.assertEquals(Assert.java:542)
	at org.apache.hadoop.yarn.server.nodemanager.scheduler.TestDistributedScheduler.testDistributedScheduler(TestDistributedScheduler.java:118)
{noformat}




--
This message was sent by Atlassian JIRA
(v6.4.14#64029)

---------------------------------------------------------------------
To unsubscribe, e-mail: yarn-dev-unsubscribe@hadoop.apache.org
For additional commands, e-mail: yarn-dev-help@hadoop.apache.org


Mime
View raw message