hadoop-yarn-dev mailing list archives

Site index · List index
Message view « Date » · « Thread »
Top « Date » · « Thread »
From "Sonia Garudi (JIRA)" <j...@apache.org>
Subject [jira] [Created] (YARN-6141) Hadoop build fails with cmake error
Date Fri, 03 Feb 2017 08:46:51 GMT
Sonia Garudi created YARN-6141:
----------------------------------

             Summary: Hadoop build fails with cmake error
                 Key: YARN-6141
                 URL: https://issues.apache.org/jira/browse/YARN-6141
             Project: Hadoop YARN
          Issue Type: Bug
          Components: nodemanager
    Affects Versions: 3.0.0-alpha3
         Environment: $ uname -a
Linux f8eef0f055cf 3.16.0-30-generic #40~14.04.1-Ubuntu SMP Thu Jan 15 17:42:36 UTC 2015 ppc64le
ppc64le ppc64le GNU/Linux
            Reporter: Sonia Garudi


On ppc64le architecture, the build fails in the 'Hadoop YARN NodeManager' project with the
below error:

Cannot safely determine executable path with a relative HADOOP_CONF_DIR on this operating
system.
[WARNING]  #error Cannot safely determine executable path with a relative HADOOP_CONF_DIR
on this operating system.
[WARNING]   ^
[WARNING] make[2]: *** [CMakeFiles/container.dir/main/native/container-executor/impl/get_executable.c.o]
Error 1
[WARNING] make[2]: *** Waiting for unfinished jobs....
[WARNING] make[1]: *** [CMakeFiles/container.dir/all] Error 2
[WARNING] make: *** [all] Error 2
[INFO] ------------------------------------------------------------------------
[INFO] BUILD FAILURE
[INFO] ------------------------------------------------------------------------

Cmake version used :
$ /usr/bin/cmake --version
cmake version 2.8.12.2



--
This message was sent by Atlassian JIRA
(v6.3.15#6346)

---------------------------------------------------------------------
To unsubscribe, e-mail: yarn-dev-unsubscribe@hadoop.apache.org
For additional commands, e-mail: yarn-dev-help@hadoop.apache.org


Mime
View raw message