hadoop-yarn-dev mailing list archives

Site index · List index
Message view « Date » · « Thread »
Top « Date » · « Thread »
From Apache Jenkins Server <jenk...@builds.apache.org>
Subject Hadoop-Yarn-trunk-Java8 - Build # 1534 - Still Failing
Date Thu, 02 Jun 2016 22:03:52 GMT
See https://builds.apache.org/job/Hadoop-Yarn-trunk-Java8/1534/

###################################################################################
########################## LAST 60 LINES OF THE CONSOLE ###########################
[...truncated 34400 lines...]
[INFO] Reactor Summary:
[INFO] 
[INFO] Apache Hadoop YARN ................................. SUCCESS [  3.111 s]
[INFO] Apache Hadoop YARN API ............................. SUCCESS [01:29 min]
[INFO] Apache Hadoop YARN Common .......................... SUCCESS [02:57 min]
[INFO] Apache Hadoop YARN Server .......................... SUCCESS [  0.057 s]
[INFO] Apache Hadoop YARN Server Common ................... SUCCESS [ 36.376 s]
[INFO] Apache Hadoop YARN NodeManager ..................... SUCCESS [11:33 min]
[INFO] Apache Hadoop YARN Web Proxy ....................... SUCCESS [ 24.030 s]
[INFO] Apache Hadoop YARN ApplicationHistoryService ....... SUCCESS [03:34 min]
[INFO] Apache Hadoop YARN ResourceManager ................. SUCCESS [44:55 min]
[INFO] Apache Hadoop YARN Server Tests .................... SUCCESS [02:16 min]
[INFO] Apache Hadoop YARN Client .......................... FAILURE [07:28 min]
[INFO] Apache Hadoop YARN SharedCacheManager .............. SKIPPED
[INFO] Apache Hadoop YARN Timeline Plugin Storage ......... SKIPPED
[INFO] Apache Hadoop YARN Applications .................... SUCCESS [  0.076 s]
[INFO] Apache Hadoop YARN DistributedShell ................ SKIPPED
[INFO] Apache Hadoop YARN Unmanaged Am Launcher ........... SKIPPED
[INFO] Apache Hadoop YARN Site ............................ SUCCESS [  0.055 s]
[INFO] Apache Hadoop YARN Registry ........................ SUCCESS [01:15 min]
[INFO] Apache Hadoop YARN Project ......................... SKIPPED
[INFO] ------------------------------------------------------------------------
[INFO] BUILD FAILURE
[INFO] ------------------------------------------------------------------------
[INFO] Total time: 01:16 h
[INFO] Finished at: 2016-06-02T22:03:25+00:00
[INFO] Final Memory: 139M/4143M
[INFO] ------------------------------------------------------------------------
[WARNING] The requested profile "docs" could not be activated because it does not exist.
[WARNING] The requested profile "parallel-tests" could not be activated because it does not
exist.
[ERROR] Failed to execute goal org.apache.maven.plugins:maven-surefire-plugin:2.17:test (default-test)
on project hadoop-yarn-client: There are test failures.
[ERROR] 
[ERROR] Please refer to /home/jenkins/jenkins-slave/workspace/Hadoop-Yarn-trunk-Java8/source/hadoop-yarn-project/hadoop-yarn/hadoop-yarn-client/target/surefire-reports
for the individual test results.
[ERROR] -> [Help 1]
[ERROR] 
[ERROR] To see the full stack trace of the errors, re-run Maven with the -e switch.
[ERROR] Re-run Maven using the -X switch to enable full debug logging.
[ERROR] 
[ERROR] For more information about the errors and possible solutions, please read the following
articles:
[ERROR] [Help 1] http://cwiki.apache.org/confluence/display/MAVEN/MojoFailureException
[ERROR] 
[ERROR] After correcting the problems, you can resume the build with the command
[ERROR]   mvn <goals> -rf :hadoop-yarn-client
Build step 'Execute shell' marked build as failure
Archiving artifacts
Setting LATEST1_8_HOME=/home/jenkins/jenkins-slave/tools/hudson.model.JDK/latest1.8
Setting MAVEN_3_3_3_HOME=/home/jenkins/jenkins-slave/tools/hudson.tasks.Maven_MavenInstallation/maven-3.3.3
Recording test results
Setting LATEST1_8_HOME=/home/jenkins/jenkins-slave/tools/hudson.model.JDK/latest1.8
Setting MAVEN_3_3_3_HOME=/home/jenkins/jenkins-slave/tools/hudson.tasks.Maven_MavenInstallation/maven-3.3.3
Setting LATEST1_8_HOME=/home/jenkins/jenkins-slave/tools/hudson.model.JDK/latest1.8
Setting MAVEN_3_3_3_HOME=/home/jenkins/jenkins-slave/tools/hudson.tasks.Maven_MavenInstallation/maven-3.3.3
Sending e-mails to: yarn-dev@hadoop.apache.org
Email was triggered for: Failure - Any
Sending email for trigger: Failure - Any
Setting LATEST1_8_HOME=/home/jenkins/jenkins-slave/tools/hudson.model.JDK/latest1.8
Setting MAVEN_3_3_3_HOME=/home/jenkins/jenkins-slave/tools/hudson.tasks.Maven_MavenInstallation/maven-3.3.3
Setting LATEST1_8_HOME=/home/jenkins/jenkins-slave/tools/hudson.model.JDK/latest1.8
Setting MAVEN_3_3_3_HOME=/home/jenkins/jenkins-slave/tools/hudson.tasks.Maven_MavenInstallation/maven-3.3.3



###################################################################################
############################## FAILED TESTS (if any) ##############################
2 tests failed.
FAILED:  org.apache.hadoop.yarn.client.TestHedgingRequestRMFailoverProxyProvider.testHedgingRequestProxyProvider

Error Message:
org.apache.hadoop.yarn.webapp.WebAppException: Error starting http server

Stack Trace:
org.apache.hadoop.yarn.exceptions.YarnRuntimeException: org.apache.hadoop.yarn.webapp.WebAppException:
Error starting http server
	at sun.nio.ch.Net.bind0(Native Method)
	at sun.nio.ch.Net.bind(Net.java:433)
	at sun.nio.ch.Net.bind(Net.java:425)
	at sun.nio.ch.ServerSocketChannelImpl.bind(ServerSocketChannelImpl.java:223)
	at sun.nio.ch.ServerSocketAdaptor.bind(ServerSocketAdaptor.java:74)
	at org.mortbay.jetty.nio.SelectChannelConnector.open(SelectChannelConnector.java:216)
	at org.apache.hadoop.http.HttpServer2.openListeners(HttpServer2.java:911)
	at org.apache.hadoop.http.HttpServer2.start(HttpServer2.java:853)
	at org.apache.hadoop.yarn.webapp.WebApps$Builder.start(WebApps.java:375)
	at org.apache.hadoop.yarn.server.resourcemanager.ResourceManager.startWepApp(ResourceManager.java:988)
	at org.apache.hadoop.yarn.server.resourcemanager.ResourceManager.serviceStart(ResourceManager.java:1090)
	at org.apache.hadoop.service.AbstractService.start(AbstractService.java:193)
	at org.apache.hadoop.yarn.server.MiniYARNCluster.startResourceManager(MiniYARNCluster.java:338)
	at org.apache.hadoop.yarn.server.MiniYARNCluster.access$300(MiniYARNCluster.java:115)
	at org.apache.hadoop.yarn.server.MiniYARNCluster$ResourceManagerWrapper.serviceStart(MiniYARNCluster.java:467)
	at org.apache.hadoop.service.AbstractService.start(AbstractService.java:193)
	at org.apache.hadoop.service.CompositeService.serviceStart(CompositeService.java:120)
	at org.apache.hadoop.yarn.server.MiniYARNCluster.serviceStart(MiniYARNCluster.java:295)
	at org.apache.hadoop.service.AbstractService.start(AbstractService.java:193)
	at org.apache.hadoop.yarn.client.TestHedgingRequestRMFailoverProxyProvider.testHedgingRequestProxyProvider(TestHedgingRequestRMFailoverProxyProvider.java:57)


FAILED:  org.apache.hadoop.yarn.client.cli.TestLogsCLI.testFetchApplictionLogs

Error Message:
expected:<[Hello]> but was:<[=====]>

Stack Trace:
org.junit.ComparisonFailure: expected:<[Hello]> but was:<[=====]>
	at org.junit.Assert.assertEquals(Assert.java:115)
	at org.junit.Assert.assertEquals(Assert.java:144)
	at org.apache.hadoop.yarn.client.cli.TestLogsCLI.testFetchApplictionLogs(TestLogsCLI.java:389)




Mime
View raw message