hadoop-yarn-dev mailing list archives

Site index · List index
Message view « Date » · « Thread »
Top « Date » · « Thread »
From Apache Jenkins Server <jenk...@builds.apache.org>
Subject Build failed in Jenkins: Hadoop-Yarn-trunk-Java8 #1455
Date Tue, 17 May 2016 22:20:44 GMT
See <https://builds.apache.org/job/Hadoop-Yarn-trunk-Java8/1455/changes>

Changes:

[yzhang] HDFS-9732, Improve DelegationTokenIdentifier.toString() for better

[junping_du] MAPREDUCE-6657. Job history server can fail on startup when NameNode is

[jianhe] Addendum patch for YARN-4832. Contributed by Junping Du

------------------------------------------
[...truncated 47519 lines...]
Generating <https://builds.apache.org/job/Hadoop-Yarn-trunk-Java8/ws/hadoop-yarn-project/hadoop-yarn/hadoop-yarn-registry/target/org/apache/hadoop/registry/client/exceptions/package-use.html...>
Generating <https://builds.apache.org/job/Hadoop-Yarn-trunk-Java8/ws/hadoop-yarn-project/hadoop-yarn/hadoop-yarn-registry/target/org/apache/hadoop/registry/client/impl/package-use.html...>
Generating <https://builds.apache.org/job/Hadoop-Yarn-trunk-Java8/ws/hadoop-yarn-project/hadoop-yarn/hadoop-yarn-registry/target/org/apache/hadoop/registry/client/impl/zk/package-use.html...>
Generating <https://builds.apache.org/job/Hadoop-Yarn-trunk-Java8/ws/hadoop-yarn-project/hadoop-yarn/hadoop-yarn-registry/target/org/apache/hadoop/registry/client/types/package-use.html...>
Generating <https://builds.apache.org/job/Hadoop-Yarn-trunk-Java8/ws/hadoop-yarn-project/hadoop-yarn/hadoop-yarn-registry/target/org/apache/hadoop/registry/client/types/yarn/package-use.html...>
Generating <https://builds.apache.org/job/Hadoop-Yarn-trunk-Java8/ws/hadoop-yarn-project/hadoop-yarn/hadoop-yarn-registry/target/org/apache/hadoop/registry/server/package-use.html...>
Generating <https://builds.apache.org/job/Hadoop-Yarn-trunk-Java8/ws/hadoop-yarn-project/hadoop-yarn/hadoop-yarn-registry/target/org/apache/hadoop/registry/server/integration/package-use.html...>
Generating <https://builds.apache.org/job/Hadoop-Yarn-trunk-Java8/ws/hadoop-yarn-project/hadoop-yarn/hadoop-yarn-registry/target/org/apache/hadoop/registry/server/services/package-use.html...>
Building index for all the packages and classes...
Generating <https://builds.apache.org/job/Hadoop-Yarn-trunk-Java8/ws/hadoop-yarn-project/hadoop-yarn/hadoop-yarn-registry/target/overview-tree.html...>
Generating <https://builds.apache.org/job/Hadoop-Yarn-trunk-Java8/ws/hadoop-yarn-project/hadoop-yarn/hadoop-yarn-registry/target/index-all.html...>
Generating <https://builds.apache.org/job/Hadoop-Yarn-trunk-Java8/ws/hadoop-yarn-project/hadoop-yarn/hadoop-yarn-registry/target/deprecated-list.html...>
Building index for all classes...
Generating <https://builds.apache.org/job/Hadoop-Yarn-trunk-Java8/ws/hadoop-yarn-project/hadoop-yarn/hadoop-yarn-registry/target/allclasses-frame.html...>
Generating <https://builds.apache.org/job/Hadoop-Yarn-trunk-Java8/ws/hadoop-yarn-project/hadoop-yarn/hadoop-yarn-registry/target/allclasses-noframe.html...>
Generating <https://builds.apache.org/job/Hadoop-Yarn-trunk-Java8/ws/hadoop-yarn-project/hadoop-yarn/hadoop-yarn-registry/target/index.html...>
Generating <https://builds.apache.org/job/Hadoop-Yarn-trunk-Java8/ws/hadoop-yarn-project/hadoop-yarn/hadoop-yarn-registry/target/overview-summary.html...>
Generating <https://builds.apache.org/job/Hadoop-Yarn-trunk-Java8/ws/hadoop-yarn-project/hadoop-yarn/hadoop-yarn-registry/target/help-doc.html...>
52 warnings
[WARNING] Javadoc Warnings
[WARNING] <https://builds.apache.org/job/Hadoop-Yarn-trunk-Java8/ws/hadoop-yarn-project/hadoop-yarn/hadoop-yarn-registry/src/main/java/org/apache/hadoop/registry/server/integration/RMRegistryOperationsService.java>:73:
warning: no description for @throws
[WARNING] * @throws Exception
[WARNING] ^
[WARNING] <https://builds.apache.org/job/Hadoop-Yarn-trunk-Java8/ws/hadoop-yarn-project/hadoop-yarn/hadoop-yarn-registry/src/main/java/org/apache/hadoop/registry/server/services/RegistryAdminService.java>:174:
warning: no description for @throws
[WARNING] * @throws IOException
[WARNING] ^
[WARNING] <https://builds.apache.org/job/Hadoop-Yarn-trunk-Java8/ws/hadoop-yarn-project/hadoop-yarn/hadoop-yarn-registry/src/main/java/org/apache/hadoop/registry/server/services/RegistryAdminService.java>:191:
warning: no description for @throws
[WARNING] * @throws Exception
[WARNING] ^
[WARNING] <https://builds.apache.org/job/Hadoop-Yarn-trunk-Java8/ws/hadoop-yarn-project/hadoop-yarn/hadoop-yarn-registry/src/main/java/org/apache/hadoop/registry/server/services/RegistryAdminService.java>:208:
warning: no description for @throws
[WARNING] * @throws Exception
[WARNING] ^
[WARNING] <https://builds.apache.org/job/Hadoop-Yarn-trunk-Java8/ws/hadoop-yarn-project/hadoop-yarn/hadoop-yarn-registry/src/main/java/org/apache/hadoop/registry/client/api/RegistryOperations.java>:118:
warning: no description for @throws
[WARNING] * @throws IOException
[WARNING] ^
[WARNING] <https://builds.apache.org/job/Hadoop-Yarn-trunk-Java8/ws/hadoop-yarn-project/hadoop-yarn/hadoop-yarn-registry/src/main/java/org/apache/hadoop/registry/client/api/RegistryOperations.java>:128:
warning: no description for @throws
[WARNING] * @throws PathNotFoundException
[WARNING] ^
[WARNING] <https://builds.apache.org/job/Hadoop-Yarn-trunk-Java8/ws/hadoop-yarn-project/hadoop-yarn/hadoop-yarn-registry/src/main/java/org/apache/hadoop/registry/client/api/RegistryOperations.java>:129:
warning: no description for @throws
[WARNING] * @throws InvalidPathnameException
[WARNING] ^
[WARNING] <https://builds.apache.org/job/Hadoop-Yarn-trunk-Java8/ws/hadoop-yarn-project/hadoop-yarn/hadoop-yarn-registry/src/main/java/org/apache/hadoop/registry/client/api/RegistryOperations.java>:130:
warning: no description for @throws
[WARNING] * @throws IOException
[WARNING] ^
[WARNING] <https://builds.apache.org/job/Hadoop-Yarn-trunk-Java8/ws/hadoop-yarn-project/hadoop-yarn/hadoop-yarn-registry/src/main/java/org/apache/hadoop/registry/client/impl/zk/CuratorService.java>:136:
warning: no description for @throws
[WARNING] * @throws Exception
[WARNING] ^
[WARNING] <https://builds.apache.org/job/Hadoop-Yarn-trunk-Java8/ws/hadoop-yarn-project/hadoop-yarn/hadoop-yarn-registry/src/main/java/org/apache/hadoop/registry/client/impl/zk/CuratorService.java>:158:
warning: no description for @throws
[WARNING] * @throws Exception
[WARNING] ^
[WARNING] <https://builds.apache.org/job/Hadoop-Yarn-trunk-Java8/ws/hadoop-yarn-project/hadoop-yarn/hadoop-yarn-registry/src/main/java/org/apache/hadoop/registry/client/impl/zk/CuratorService.java>:295:
warning: no @throws for java.io.IOException
[WARNING] protected String createFullPath(String path) throws IOException {
[WARNING] ^
[WARNING] <https://builds.apache.org/job/Hadoop-Yarn-trunk-Java8/ws/hadoop-yarn-project/hadoop-yarn/hadoop-yarn-registry/src/main/java/org/apache/hadoop/registry/client/impl/zk/CuratorService.java>:370:
warning: no @param for acls
[WARNING] protected IOException operationFailure(String path,
[WARNING] ^
[WARNING] <https://builds.apache.org/job/Hadoop-Yarn-trunk-Java8/ws/hadoop-yarn-project/hadoop-yarn/hadoop-yarn-registry/src/main/java/org/apache/hadoop/registry/client/impl/zk/CuratorService.java>:424:
warning: no description for @throws
[WARNING] * @throws IOException
[WARNING] ^
[WARNING] <https://builds.apache.org/job/Hadoop-Yarn-trunk-Java8/ws/hadoop-yarn-project/hadoop-yarn/hadoop-yarn-registry/src/main/java/org/apache/hadoop/registry/client/impl/zk/CuratorService.java>:427:
warning: no @param for mode
[WARNING] public boolean maybeCreate(String path,
[WARNING] ^
[WARNING] <https://builds.apache.org/job/Hadoop-Yarn-trunk-Java8/ws/hadoop-yarn-project/hadoop-yarn/hadoop-yarn-registry/src/main/java/org/apache/hadoop/registry/client/impl/zk/CuratorService.java>:463:
warning: no description for @throws
[WARNING] * @throws IOException
[WARNING] ^
[WARNING] <https://builds.apache.org/job/Hadoop-Yarn-trunk-Java8/ws/hadoop-yarn-project/hadoop-yarn/hadoop-yarn-registry/src/main/java/org/apache/hadoop/registry/client/impl/zk/CuratorService.java>:509:
warning: no description for @throws
[WARNING] * @throws IOException
[WARNING] ^
[WARNING] <https://builds.apache.org/job/Hadoop-Yarn-trunk-Java8/ws/hadoop-yarn-project/hadoop-yarn/hadoop-yarn-registry/src/main/java/org/apache/hadoop/registry/client/impl/zk/CuratorService.java>:511:
warning: no @return
[WARNING] public String zkPathMustExist(String path) throws IOException {
[WARNING] ^
[WARNING] <https://builds.apache.org/job/Hadoop-Yarn-trunk-Java8/ws/hadoop-yarn-project/hadoop-yarn/hadoop-yarn-registry/src/main/java/org/apache/hadoop/registry/client/impl/zk/CuratorService.java>:524:
warning: no @return
[WARNING] public boolean zkMkPath(String path,
[WARNING] ^
[WARNING] <https://builds.apache.org/job/Hadoop-Yarn-trunk-Java8/ws/hadoop-yarn-project/hadoop-yarn/hadoop-yarn-registry/src/main/java/org/apache/hadoop/registry/client/impl/zk/CuratorService.java>:580:
warning: no description for @param
[WARNING] * @param acls
[WARNING] ^
[WARNING] <https://builds.apache.org/job/Hadoop-Yarn-trunk-Java8/ws/hadoop-yarn-project/hadoop-yarn/hadoop-yarn-registry/src/main/java/org/apache/hadoop/registry/client/impl/zk/CuratorService.java>:581:
warning: no description for @throws
[WARNING] * @throws IOException
[WARNING] ^
[WARNING] <https://builds.apache.org/job/Hadoop-Yarn-trunk-Java8/ws/hadoop-yarn-project/hadoop-yarn/hadoop-yarn-registry/src/main/java/org/apache/hadoop/registry/client/impl/zk/CuratorService.java>:583:
warning: no @param for mode
[WARNING] public void zkCreate(String path,
[WARNING] ^
[WARNING] <https://builds.apache.org/job/Hadoop-Yarn-trunk-Java8/ws/hadoop-yarn-project/hadoop-yarn/hadoop-yarn-registry/src/main/java/org/apache/hadoop/registry/client/impl/zk/CuratorService.java>:606:
warning: no description for @throws
[WARNING] * @throws IOException
[WARNING] ^
[WARNING] <https://builds.apache.org/job/Hadoop-Yarn-trunk-Java8/ws/hadoop-yarn-project/hadoop-yarn/hadoop-yarn-registry/src/main/java/org/apache/hadoop/registry/client/impl/zk/CuratorService.java>:628:
warning: no description for @throws
[WARNING] * @throws IOException
[WARNING] ^
[WARNING] <https://builds.apache.org/job/Hadoop-Yarn-trunk-Java8/ws/hadoop-yarn-project/hadoop-yarn/hadoop-yarn-registry/src/main/java/org/apache/hadoop/registry/client/impl/zk/CuratorService.java>:631:
warning: no @param for mode
[WARNING] public boolean zkSet(String path,
[WARNING] ^
[WARNING] <https://builds.apache.org/job/Hadoop-Yarn-trunk-Java8/ws/hadoop-yarn-project/hadoop-yarn/hadoop-yarn-registry/src/main/java/org/apache/hadoop/registry/client/impl/zk/CuratorService.java>:688:
warning: no description for @throws
[WARNING] * @throws IOException
[WARNING] ^
[WARNING] <https://builds.apache.org/job/Hadoop-Yarn-trunk-Java8/ws/hadoop-yarn-project/hadoop-yarn/hadoop-yarn-registry/src/main/java/org/apache/hadoop/registry/client/impl/zk/CuratorService.java>:741:
warning: no @return
[WARNING] public boolean addWriteAccessor(String id, String pass) throws IOException {
[WARNING] ^
[WARNING] <https://builds.apache.org/job/Hadoop-Yarn-trunk-Java8/ws/hadoop-yarn-project/hadoop-yarn/hadoop-yarn-registry/src/main/java/org/apache/hadoop/registry/server/services/MicroZookeeperService.java>:130:
warning: no description for @throws
[WARNING] * @throws Exception
[WARNING] ^
[WARNING] <https://builds.apache.org/job/Hadoop-Yarn-trunk-Java8/ws/hadoop-yarn-project/hadoop-yarn/hadoop-yarn-registry/src/main/java/org/apache/hadoop/registry/server/services/MicroZookeeperService.java>:196:
warning: no @throws for java.io.IOException
[WARNING] public boolean setupSecurity() throws IOException {
[WARNING] ^
[WARNING] <https://builds.apache.org/job/Hadoop-Yarn-trunk-Java8/ws/hadoop-yarn-project/hadoop-yarn/hadoop-yarn-registry/src/main/java/org/apache/hadoop/registry/server/services/MicroZookeeperService.java>:223:
warning: no description for @throws
[WARNING] * @throws Exception
[WARNING] ^
[WARNING] <https://builds.apache.org/job/Hadoop-Yarn-trunk-Java8/ws/hadoop-yarn-project/hadoop-yarn/hadoop-yarn-registry/src/main/java/org/apache/hadoop/registry/server/services/MicroZookeeperService.java>:263:
warning: no description for @throws
[WARNING] * @throws Exception
[WARNING] ^
[WARNING] <https://builds.apache.org/job/Hadoop-Yarn-trunk-Java8/ws/hadoop-yarn-project/hadoop-yarn/hadoop-yarn-registry/src/main/java/org/apache/hadoop/registry/client/types/Endpoint.java>:229:
warning: no description for @throws
[WARNING] * @throws CloneNotSupportedException
[WARNING] ^
[WARNING] <https://builds.apache.org/job/Hadoop-Yarn-trunk-Java8/ws/hadoop-yarn-project/hadoop-yarn/hadoop-yarn-registry/src/main/java/org/apache/hadoop/registry/client/types/ServiceRecord.java>:241:
warning: no description for @throws
[WARNING] * @throws CloneNotSupportedException
[WARNING] ^
[WARNING] <https://builds.apache.org/job/Hadoop-Yarn-trunk-Java8/ws/hadoop-yarn-project/hadoop-yarn/hadoop-yarn-registry/src/main/java/org/apache/hadoop/registry/client/binding/JsonSerDeser.java>:101:
warning: no @throws for org.codehaus.jackson.JsonParseException
[WARNING] public synchronized T fromJson(String json)
[WARNING] ^
[WARNING] <https://builds.apache.org/job/Hadoop-Yarn-trunk-Java8/ws/hadoop-yarn-project/hadoop-yarn/hadoop-yarn-registry/src/main/java/org/apache/hadoop/registry/client/binding/JsonSerDeser.java>:119:
warning: no @throws for org.codehaus.jackson.JsonParseException
[WARNING] public synchronized T fromFile(File jsonFile)
[WARNING] ^
[WARNING] <https://builds.apache.org/job/Hadoop-Yarn-trunk-Java8/ws/hadoop-yarn-project/hadoop-yarn/hadoop-yarn-registry/src/main/java/org/apache/hadoop/registry/client/binding/JsonSerDeser.java>:137:
warning: no @throws for org.codehaus.jackson.JsonParseException
[WARNING] public synchronized T fromResource(String resource)
[WARNING] ^
[WARNING] <https://builds.apache.org/job/Hadoop-Yarn-trunk-Java8/ws/hadoop-yarn-project/hadoop-yarn/hadoop-yarn-registry/src/main/java/org/apache/hadoop/registry/client/binding/JsonSerDeser.java>:195:
warning: no @param for instance
[WARNING] public void save(FileSystem fs, Path path, T instance,
[WARNING] ^
[WARNING] <https://builds.apache.org/job/Hadoop-Yarn-trunk-Java8/ws/hadoop-yarn-project/hadoop-yarn/hadoop-yarn-registry/src/main/java/org/apache/hadoop/registry/client/binding/JsonSerDeser.java>:221:
warning: no description for @throws
[WARNING] * @throws IOException
[WARNING] ^
[WARNING] <https://builds.apache.org/job/Hadoop-Yarn-trunk-Java8/ws/hadoop-yarn-project/hadoop-yarn/hadoop-yarn-registry/src/main/java/org/apache/hadoop/registry/client/binding/JsonSerDeser.java>:236:
warning: no @return
[WARNING] public T fromBytes(String path, byte[] bytes) throws IOException,
[WARNING] ^
[WARNING] <https://builds.apache.org/job/Hadoop-Yarn-trunk-Java8/ws/hadoop-yarn-project/hadoop-yarn/hadoop-yarn-registry/src/main/java/org/apache/hadoop/registry/client/binding/JsonSerDeser.java>:287:
warning: no @throws for org.codehaus.jackson.JsonGenerationException
[WARNING] public synchronized String toJson(T instance) throws IOException,
[WARNING] ^
[WARNING] <https://builds.apache.org/job/Hadoop-Yarn-trunk-Java8/ws/hadoop-yarn-project/hadoop-yarn/hadoop-yarn-registry/src/main/java/org/apache/hadoop/registry/client/binding/RegistryPathUtils.java>:91:
warning: no @param for base
[WARNING] public static String createFullPath(String base, String path) throws
[WARNING] ^
[WARNING] <https://builds.apache.org/job/Hadoop-Yarn-trunk-Java8/ws/hadoop-yarn-project/hadoop-yarn/hadoop-yarn-registry/src/main/java/org/apache/hadoop/registry/client/binding/RegistryUtils.java>:170:
warning: no description for @throws
[WARNING] * @throws IOException
[WARNING] ^
[WARNING] <https://builds.apache.org/job/Hadoop-Yarn-trunk-Java8/ws/hadoop-yarn-project/hadoop-yarn/hadoop-yarn-registry/src/main/java/org/apache/hadoop/registry/client/binding/RegistryUtils.java>:198:
warning: no @param for registryOperations
[WARNING] public static Map<String, RegistryPathStatus> statChildren(
[WARNING] ^
[WARNING] <https://builds.apache.org/job/Hadoop-Yarn-trunk-Java8/ws/hadoop-yarn-project/hadoop-yarn/hadoop-yarn-registry/src/main/java/org/apache/hadoop/registry/client/binding/RegistryUtils.java>:350:
warning: no @param for stats
[WARNING] public static Map<String, ServiceRecord> extractServiceRecords(
[WARNING] ^
[WARNING] <https://builds.apache.org/job/Hadoop-Yarn-trunk-Java8/ws/hadoop-yarn-project/hadoop-yarn/hadoop-yarn-registry/src/main/java/org/apache/hadoop/registry/client/impl/zk/RegistrySecurity.java>:187:
warning: no description for @throws
[WARNING] * @throws Exception
[WARNING] ^
[WARNING] <https://builds.apache.org/job/Hadoop-Yarn-trunk-Java8/ws/hadoop-yarn-project/hadoop-yarn/hadoop-yarn-registry/src/main/java/org/apache/hadoop/registry/client/impl/zk/RegistrySecurity.java>:320:
warning: no @return
[WARNING] public boolean addDigestACL(ACL acl) {
[WARNING] ^
[WARNING] <https://builds.apache.org/job/Hadoop-Yarn-trunk-Java8/ws/hadoop-yarn-project/hadoop-yarn/hadoop-yarn-registry/src/main/java/org/apache/hadoop/registry/client/impl/zk/RegistrySecurity.java>:378:
warning: no description for @throws
[WARNING] * @throws IOException
[WARNING] ^
[WARNING] <https://builds.apache.org/job/Hadoop-Yarn-trunk-Java8/ws/hadoop-yarn-project/hadoop-yarn/hadoop-yarn-registry/src/main/java/org/apache/hadoop/registry/client/impl/zk/RegistrySecurity.java>:444:
warning: no @throws for java.io.IOException
[WARNING] public String digest(String idPasswordPair) throws IOException {
[WARNING] ^
[WARNING] <https://builds.apache.org/job/Hadoop-Yarn-trunk-Java8/ws/hadoop-yarn-project/hadoop-yarn/hadoop-yarn-registry/src/main/java/org/apache/hadoop/registry/client/impl/zk/RegistrySecurity.java>:462:
warning: no description for @throws
[WARNING] * @throws IOException
[WARNING] ^
[WARNING] <https://builds.apache.org/job/Hadoop-Yarn-trunk-Java8/ws/hadoop-yarn-project/hadoop-yarn/hadoop-yarn-registry/src/main/java/org/apache/hadoop/registry/client/impl/zk/RegistrySecurity.java>:482:
warning: no description for @throws
[WARNING] * @throws IOException
[WARNING] ^
[WARNING] <https://builds.apache.org/job/Hadoop-Yarn-trunk-Java8/ws/hadoop-yarn-project/hadoop-yarn/hadoop-yarn-registry/src/main/java/org/apache/hadoop/registry/client/impl/zk/RegistrySecurity.java>:550:
warning: no description for @throws
[WARNING] * @throws IOException
[WARNING] ^
[WARNING] <https://builds.apache.org/job/Hadoop-Yarn-trunk-Java8/ws/hadoop-yarn-project/hadoop-yarn/hadoop-yarn-registry/src/main/java/org/apache/hadoop/registry/client/impl/zk/RegistrySecurity.java>:923:
warning: no @param for perms
[WARNING] public ACL createACLForUser(UserGroupInformation ugi, int perms) {
[WARNING] ^
[WARNING] <https://builds.apache.org/job/Hadoop-Yarn-trunk-Java8/ws/hadoop-yarn-project/hadoop-yarn/hadoop-yarn-registry/src/main/java/org/apache/hadoop/registry/cli/RegistryCli.java>:124:
warning: no description for @throws
[WARNING] * @throws IOException
[WARNING] ^
[INFO] Building jar: <https://builds.apache.org/job/Hadoop-Yarn-trunk-Java8/ws/hadoop-yarn-project/hadoop-yarn/hadoop-yarn-registry/target/hadoop-yarn-registry-3.0.0-alpha1-SNAPSHOT-javadoc.jar>
[INFO] 
[INFO] --- maven-enforcer-plugin:1.3.1:enforce (depcheck) @ hadoop-yarn-registry ---
[INFO] 
[INFO] --- maven-checkstyle-plugin:2.15:checkstyle (default-cli) @ hadoop-yarn-registry ---
[INFO] There are 509 errors reported by Checkstyle 6.6 with checkstyle/checkstyle.xml ruleset.
[WARNING] Unable to locate Source XRef to link to - DISABLED
[INFO] 
[INFO] --- findbugs-maven-plugin:3.0.0:findbugs (default-cli) @ hadoop-yarn-registry ---
[INFO] Fork Value is true
[INFO] Done FindBugs Analysis....
[INFO]                                                                         
[INFO] ------------------------------------------------------------------------
[INFO] Skipping Apache Hadoop YARN Project
[INFO] This project has been banned from the build due to previous failures.
[INFO] ------------------------------------------------------------------------
[INFO] ------------------------------------------------------------------------
[INFO] Reactor Summary:
[INFO] 
[INFO] Apache Hadoop YARN ................................. SUCCESS [  4.866 s]
[INFO] Apache Hadoop YARN API ............................. SUCCESS [01:48 min]
[INFO] Apache Hadoop YARN Common .......................... SUCCESS [02:59 min]
[INFO] Apache Hadoop YARN Server .......................... SUCCESS [  0.056 s]
[INFO] Apache Hadoop YARN Server Common ................... SUCCESS [ 38.978 s]
[INFO] Apache Hadoop YARN NodeManager ..................... FAILURE [11:15 min]
[INFO] Apache Hadoop YARN Web Proxy ....................... SUCCESS [ 19.304 s]
[INFO] Apache Hadoop YARN ApplicationHistoryService ....... FAILURE [03:29 min]
[INFO] Apache Hadoop YARN ResourceManager ................. SKIPPED
[INFO] Apache Hadoop YARN Server Tests .................... SKIPPED
[INFO] Apache Hadoop YARN Client .......................... SKIPPED
[INFO] Apache Hadoop YARN SharedCacheManager .............. SKIPPED
[INFO] Apache Hadoop YARN Timeline Plugin Storage ......... SKIPPED
[INFO] Apache Hadoop YARN Applications .................... SUCCESS [  0.045 s]
[INFO] Apache Hadoop YARN DistributedShell ................ SKIPPED
[INFO] Apache Hadoop YARN Unmanaged Am Launcher ........... SKIPPED
[INFO] Apache Hadoop YARN Site ............................ SUCCESS [  0.053 s]
[INFO] Apache Hadoop YARN Registry ........................ SUCCESS [01:57 min]
[INFO] Apache Hadoop YARN Project ......................... SKIPPED
[INFO] ------------------------------------------------------------------------
[INFO] BUILD FAILURE
[INFO] ------------------------------------------------------------------------
[INFO] Total time: 22:35 min
[INFO] Finished at: 2016-05-17T22:20:28+00:00
[INFO] Final Memory: 137M/4659M
[INFO] ------------------------------------------------------------------------
[WARNING] The requested profile "docs" could not be activated because it does not exist.
[WARNING] The requested profile "parallel-tests" could not be activated because it does not
exist.
[ERROR] Failed to execute goal org.apache.maven.plugins:maven-surefire-plugin:2.17:test (default-test)
on project hadoop-yarn-server-nodemanager: There are test failures.
[ERROR] 
[ERROR] Please refer to <https://builds.apache.org/job/Hadoop-Yarn-trunk-Java8/ws/hadoop-yarn-project/hadoop-yarn/hadoop-yarn-server/hadoop-yarn-server-nodemanager/target/surefire-reports>
for the individual test results.
[ERROR] -> [Help 1]
[ERROR] Failed to execute goal org.apache.maven.plugins:maven-surefire-plugin:2.17:test (default-test)
on project hadoop-yarn-server-applicationhistoryservice: There are test failures.
[ERROR] 
[ERROR] Please refer to <https://builds.apache.org/job/Hadoop-Yarn-trunk-Java8/ws/hadoop-yarn-project/hadoop-yarn/hadoop-yarn-server/hadoop-yarn-server-applicationhistoryservice/target/surefire-reports>
for the individual test results.
[ERROR] -> [Help 1]
[ERROR] 
[ERROR] To see the full stack trace of the errors, re-run Maven with the -e switch.
[ERROR] Re-run Maven using the -X switch to enable full debug logging.
[ERROR] 
[ERROR] For more information about the errors and possible solutions, please read the following
articles:
[ERROR] [Help 1] http://cwiki.apache.org/confluence/display/MAVEN/MojoFailureException
[ERROR] 
[ERROR] After correcting the problems, you can resume the build with the command
[ERROR]   mvn <goals> -rf :hadoop-yarn-server-nodemanager
Build step 'Execute shell' marked build as failure
Archiving artifacts
Setting LATEST1_8_HOME=/home/jenkins/jenkins-slave/tools/hudson.model.JDK/latest1.8
Setting MAVEN_3_3_3_HOME=/home/jenkins/jenkins-slave/tools/hudson.tasks.Maven_MavenInstallation/maven-3.3.3
Recording test results
Setting LATEST1_8_HOME=/home/jenkins/jenkins-slave/tools/hudson.model.JDK/latest1.8
Setting MAVEN_3_3_3_HOME=/home/jenkins/jenkins-slave/tools/hudson.tasks.Maven_MavenInstallation/maven-3.3.3
Setting LATEST1_8_HOME=/home/jenkins/jenkins-slave/tools/hudson.model.JDK/latest1.8
Setting MAVEN_3_3_3_HOME=/home/jenkins/jenkins-slave/tools/hudson.tasks.Maven_MavenInstallation/maven-3.3.3

---------------------------------------------------------------------
To unsubscribe, e-mail: yarn-dev-unsubscribe@hadoop.apache.org
For additional commands, e-mail: yarn-dev-help@hadoop.apache.org


Mime
View raw message