hadoop-yarn-dev mailing list archives

Site index · List index
Message view « Date » · « Thread »
Top « Date » · « Thread »
From Apache Jenkins Server <jenk...@builds.apache.org>
Subject Hadoop-Yarn-trunk-Java8 - Build # 1409 - Still Failing
Date Tue, 10 May 2016 00:26:02 GMT
See https://builds.apache.org/job/Hadoop-Yarn-trunk-Java8/1409/

###################################################################################
########################## LAST 60 LINES OF THE CONSOLE ###########################
[...truncated 5336 lines...]
Running org.apache.hadoop.yarn.server.resourcemanager.TestKillApplicationWithRMHA
Tests run: 4, Failures: 0, Errors: 0, Skipped: 0, Time elapsed: 4.595 sec - in org.apache.hadoop.yarn.server.resourcemanager.TestKillApplicationWithRMHA

Results :

Failed tests: 
  TestContainerResourceUsage.testUsageAfterAMRestartWithMultipleContainers:252->amRestartTests:395
Unexcpected MemorySeconds value expected:<-1497946354406> but was:<2143>
  TestAMRestart.testShouldNotCountFailureToMaxAttemptRetry:647 Attempt state is not correct
(timeout). expected:<SCHEDULED> but was:<ALLOCATED>

Tests run: 1399, Failures: 2, Errors: 0, Skipped: 3

[INFO] ------------------------------------------------------------------------
[INFO] Reactor Summary:
[INFO] 
[INFO] Apache Hadoop YARN ................................ SUCCESS [  3.334 s]
[INFO] Apache Hadoop YARN API ............................ SUCCESS [01:35 min]
[INFO] Apache Hadoop YARN Common ......................... SUCCESS [02:52 min]
[INFO] Apache Hadoop YARN Server ......................... SUCCESS [  0.090 s]
[INFO] Apache Hadoop YARN Server Common .................. SUCCESS [ 45.556 s]
[INFO] Apache Hadoop YARN NodeManager .................... SUCCESS [12:40 min]
[INFO] Apache Hadoop YARN Web Proxy ...................... SUCCESS [ 18.257 s]
[INFO] Apache Hadoop YARN ApplicationHistoryService ...... SUCCESS [03:26 min]
[INFO] Apache Hadoop YARN ResourceManager ................ FAILURE [32:06 min]
[INFO] Apache Hadoop YARN Server Tests ................... SKIPPED
[INFO] Apache Hadoop YARN Client ......................... SKIPPED
[INFO] Apache Hadoop YARN SharedCacheManager ............. SKIPPED
[INFO] Apache Hadoop YARN Timeline Plugin Storage ........ SKIPPED
[INFO] Apache Hadoop YARN Applications ................... SKIPPED
[INFO] Apache Hadoop YARN DistributedShell ............... SKIPPED
[INFO] Apache Hadoop YARN Unmanaged Am Launcher .......... SKIPPED
[INFO] Apache Hadoop YARN Site ........................... SKIPPED
[INFO] Apache Hadoop YARN Registry ....................... SKIPPED
[INFO] Apache Hadoop YARN Project ........................ SKIPPED
[INFO] ------------------------------------------------------------------------
[INFO] BUILD FAILURE
[INFO] ------------------------------------------------------------------------
[INFO] Total time: 53:49 min
[INFO] Finished at: 2016-05-10T00:26:04+00:00
[INFO] Final Memory: 85M/1072M
[INFO] ------------------------------------------------------------------------
[ERROR] Failed to execute goal org.apache.maven.plugins:maven-surefire-plugin:2.17:test (default-test)
on project hadoop-yarn-server-resourcemanager: There are test failures.
[ERROR] 
[ERROR] Please refer to /home/jenkins/jenkins-slave/workspace/Hadoop-Yarn-trunk-Java8/hadoop-yarn-project/hadoop-yarn/hadoop-yarn-server/hadoop-yarn-server-resourcemanager/target/surefire-reports
for the individual test results.
[ERROR] -> [Help 1]
[ERROR] 
[ERROR] To see the full stack trace of the errors, re-run Maven with the -e switch.
[ERROR] Re-run Maven using the -X switch to enable full debug logging.
[ERROR] 
[ERROR] For more information about the errors and possible solutions, please read the following
articles:
[ERROR] [Help 1] http://cwiki.apache.org/confluence/display/MAVEN/MojoFailureException
[ERROR] 
[ERROR] After correcting the problems, you can resume the build with the command
[ERROR]   mvn <goals> -rf :hadoop-yarn-server-resourcemanager
Build step 'Execute shell' marked build as failure
Archiving artifacts
Recording test results
Sending e-mails to: yarn-dev@hadoop.apache.org
Email was triggered for: Failure - Any
Sending email for trigger: Failure - Any



###################################################################################
############################## FAILED TESTS (if any) ##############################
2 tests failed.
FAILED:  org.apache.hadoop.yarn.server.resourcemanager.applicationsmanager.TestAMRestart.testShouldNotCountFailureToMaxAttemptRetry

Error Message:
Attempt state is not correct (timeout). expected:<SCHEDULED> but was:<ALLOCATED>

Stack Trace:
java.lang.AssertionError: Attempt state is not correct (timeout). expected:<SCHEDULED>
but was:<ALLOCATED>
	at org.junit.Assert.fail(Assert.java:88)
	at org.junit.Assert.failNotEquals(Assert.java:743)
	at org.junit.Assert.assertEquals(Assert.java:118)
	at org.apache.hadoop.yarn.server.resourcemanager.MockRM.waitForState(MockRM.java:266)
	at org.apache.hadoop.yarn.server.resourcemanager.MockRM.waitForState(MockRM.java:225)
	at org.apache.hadoop.yarn.server.resourcemanager.MockRM.waitForState(MockRM.java:207)
	at org.apache.hadoop.yarn.server.resourcemanager.MockRM.waitForAttemptScheduled(MockRM.java:955)
	at org.apache.hadoop.yarn.server.resourcemanager.MockRM.launchAM(MockRM.java:942)
	at org.apache.hadoop.yarn.server.resourcemanager.MockRM.launchAndRegisterAM(MockRM.java:961)
	at org.apache.hadoop.yarn.server.resourcemanager.MockRM.waitForNewAMToLaunchAndRegister(MockRM.java:295)
	at org.apache.hadoop.yarn.server.resourcemanager.applicationsmanager.TestAMRestart.testShouldNotCountFailureToMaxAttemptRetry(TestAMRestart.java:647)


FAILED:  org.apache.hadoop.yarn.server.resourcemanager.TestContainerResourceUsage.testUsageAfterAMRestartWithMultipleContainers

Error Message:
Unexcpected MemorySeconds value expected:<-1497946354406> but was:<2143>

Stack Trace:
java.lang.AssertionError: Unexcpected MemorySeconds value expected:<-1497946354406>
but was:<2143>
	at org.junit.Assert.fail(Assert.java:88)
	at org.junit.Assert.failNotEquals(Assert.java:743)
	at org.junit.Assert.assertEquals(Assert.java:118)
	at org.junit.Assert.assertEquals(Assert.java:555)
	at org.apache.hadoop.yarn.server.resourcemanager.TestContainerResourceUsage.amRestartTests(TestContainerResourceUsage.java:395)
	at org.apache.hadoop.yarn.server.resourcemanager.TestContainerResourceUsage.testUsageAfterAMRestartWithMultipleContainers(TestContainerResourceUsage.java:252)




Mime
View raw message