hadoop-yarn-dev mailing list archives

Site index · List index
Message view « Date » · « Thread »
Top « Date » · « Thread »
From Apache Jenkins Server <jenk...@builds.apache.org>
Subject Hadoop-Yarn-trunk-Java8 - Build # 1399 - Failure
Date Thu, 05 May 2016 23:51:38 GMT
See https://builds.apache.org/job/Hadoop-Yarn-trunk-Java8/1399/

###################################################################################
########################## LAST 60 LINES OF THE CONSOLE ###########################
[...truncated 5321 lines...]
Java HotSpot(TM) 64-Bit Server VM warning: ignoring option MaxPermSize=768m; support was removed
in 8.0
Running org.apache.hadoop.yarn.webapp.TestRMWithCSRFFilter
Tests run: 4, Failures: 0, Errors: 0, Skipped: 0, Time elapsed: 5.259 sec - in org.apache.hadoop.yarn.webapp.TestRMWithCSRFFilter

Results :

Failed tests: 
  TestContainerResourceUsage.testUsageAfterAMRestartWithMultipleContainers:252->amRestartTests:395
Unexcpected MemorySeconds value expected:<-1497591222292> but was:<2144>

Tests run: 1393, Failures: 1, Errors: 0, Skipped: 3

[INFO] ------------------------------------------------------------------------
[INFO] Reactor Summary:
[INFO] 
[INFO] Apache Hadoop YARN ................................ SUCCESS [  3.661 s]
[INFO] Apache Hadoop YARN API ............................ SUCCESS [01:34 min]
[INFO] Apache Hadoop YARN Common ......................... SUCCESS [02:46 min]
[INFO] Apache Hadoop YARN Server ......................... SUCCESS [  0.081 s]
[INFO] Apache Hadoop YARN Server Common .................. SUCCESS [ 37.055 s]
[INFO] Apache Hadoop YARN NodeManager .................... SUCCESS [12:09 min]
[INFO] Apache Hadoop YARN Web Proxy ...................... SUCCESS [ 17.707 s]
[INFO] Apache Hadoop YARN ApplicationHistoryService ...... SUCCESS [03:41 min]
[INFO] Apache Hadoop YARN ResourceManager ................ FAILURE [32:46 min]
[INFO] Apache Hadoop YARN Server Tests ................... SKIPPED
[INFO] Apache Hadoop YARN Client ......................... SKIPPED
[INFO] Apache Hadoop YARN SharedCacheManager ............. SKIPPED
[INFO] Apache Hadoop YARN Timeline Plugin Storage ........ SKIPPED
[INFO] Apache Hadoop YARN Applications ................... SKIPPED
[INFO] Apache Hadoop YARN DistributedShell ............... SKIPPED
[INFO] Apache Hadoop YARN Unmanaged Am Launcher .......... SKIPPED
[INFO] Apache Hadoop YARN Site ........................... SKIPPED
[INFO] Apache Hadoop YARN Registry ....................... SKIPPED
[INFO] Apache Hadoop YARN Project ........................ SKIPPED
[INFO] ------------------------------------------------------------------------
[INFO] BUILD FAILURE
[INFO] ------------------------------------------------------------------------
[INFO] Total time: 53:57 min
[INFO] Finished at: 2016-05-05T23:51:38+00:00
[INFO] Final Memory: 83M/1076M
[INFO] ------------------------------------------------------------------------
[ERROR] Failed to execute goal org.apache.maven.plugins:maven-surefire-plugin:2.17:test (default-test)
on project hadoop-yarn-server-resourcemanager: There are test failures.
[ERROR] 
[ERROR] Please refer to /home/jenkins/jenkins-slave/workspace/Hadoop-Yarn-trunk-Java8/hadoop-yarn-project/hadoop-yarn/hadoop-yarn-server/hadoop-yarn-server-resourcemanager/target/surefire-reports
for the individual test results.
[ERROR] -> [Help 1]
[ERROR] 
[ERROR] To see the full stack trace of the errors, re-run Maven with the -e switch.
[ERROR] Re-run Maven using the -X switch to enable full debug logging.
[ERROR] 
[ERROR] For more information about the errors and possible solutions, please read the following
articles:
[ERROR] [Help 1] http://cwiki.apache.org/confluence/display/MAVEN/MojoFailureException
[ERROR] 
[ERROR] After correcting the problems, you can resume the build with the command
[ERROR]   mvn <goals> -rf :hadoop-yarn-server-resourcemanager
Build step 'Execute shell' marked build as failure
Archiving artifacts
Recording test results
Sending e-mails to: yarn-dev@hadoop.apache.org
Email was triggered for: Failure - Any
Sending email for trigger: Failure - Any



###################################################################################
############################## FAILED TESTS (if any) ##############################
1 tests failed.
FAILED:  org.apache.hadoop.yarn.server.resourcemanager.TestContainerResourceUsage.testUsageAfterAMRestartWithMultipleContainers

Error Message:
Unexcpected MemorySeconds value expected:<-1497591222292> but was:<2144>

Stack Trace:
java.lang.AssertionError: Unexcpected MemorySeconds value expected:<-1497591222292>
but was:<2144>
	at org.junit.Assert.fail(Assert.java:88)
	at org.junit.Assert.failNotEquals(Assert.java:743)
	at org.junit.Assert.assertEquals(Assert.java:118)
	at org.junit.Assert.assertEquals(Assert.java:555)
	at org.apache.hadoop.yarn.server.resourcemanager.TestContainerResourceUsage.amRestartTests(TestContainerResourceUsage.java:395)
	at org.apache.hadoop.yarn.server.resourcemanager.TestContainerResourceUsage.testUsageAfterAMRestartWithMultipleContainers(TestContainerResourceUsage.java:252)




Mime
View raw message