hadoop-yarn-dev mailing list archives

Site index · List index
Message view « Date » · « Thread »
Top « Date » · « Thread »
From Apache Jenkins Server <jenk...@builds.apache.org>
Subject Hadoop-Yarn-trunk-Java8 - Build # 1416 - Still Failing
Date Wed, 11 May 2016 06:37:20 GMT
See https://builds.apache.org/job/Hadoop-Yarn-trunk-Java8/1416/

###################################################################################
########################## LAST 60 LINES OF THE CONSOLE ###########################
[...truncated 5327 lines...]

Results :

Failed tests: 
  TestContainerResourceUsage.testUsageAfterAMRestartWithMultipleContainers:252->amRestartTests:395
Unexcpected MemorySeconds value expected:<-1498057569615> but was:<2157>

Tests in error: 
  TestFifoScheduler.testResourceOverCommit:1143 NullPointer

Tests run: 1399, Failures: 1, Errors: 1, Skipped: 3

[INFO] ------------------------------------------------------------------------
[INFO] Reactor Summary:
[INFO] 
[INFO] Apache Hadoop YARN ................................ SUCCESS [  3.238 s]
[INFO] Apache Hadoop YARN API ............................ SUCCESS [01:36 min]
[INFO] Apache Hadoop YARN Common ......................... SUCCESS [02:41 min]
[INFO] Apache Hadoop YARN Server ......................... SUCCESS [  0.089 s]
[INFO] Apache Hadoop YARN Server Common .................. SUCCESS [ 44.097 s]
[INFO] Apache Hadoop YARN NodeManager .................... SUCCESS [12:13 min]
[INFO] Apache Hadoop YARN Web Proxy ...................... SUCCESS [ 16.746 s]
[INFO] Apache Hadoop YARN ApplicationHistoryService ...... SUCCESS [03:28 min]
[INFO] Apache Hadoop YARN ResourceManager ................ FAILURE [31:20 min]
[INFO] Apache Hadoop YARN Server Tests ................... SKIPPED
[INFO] Apache Hadoop YARN Client ......................... SKIPPED
[INFO] Apache Hadoop YARN SharedCacheManager ............. SKIPPED
[INFO] Apache Hadoop YARN Timeline Plugin Storage ........ SKIPPED
[INFO] Apache Hadoop YARN Applications ................... SKIPPED
[INFO] Apache Hadoop YARN DistributedShell ............... SKIPPED
[INFO] Apache Hadoop YARN Unmanaged Am Launcher .......... SKIPPED
[INFO] Apache Hadoop YARN Site ........................... SKIPPED
[INFO] Apache Hadoop YARN Registry ....................... SKIPPED
[INFO] Apache Hadoop YARN Project ........................ SKIPPED
[INFO] ------------------------------------------------------------------------
[INFO] BUILD FAILURE
[INFO] ------------------------------------------------------------------------
[INFO] Total time: 52:26 min
[INFO] Finished at: 2016-05-11T06:37:25+00:00
[INFO] Final Memory: 85M/1023M
[INFO] ------------------------------------------------------------------------
[ERROR] Failed to execute goal org.apache.maven.plugins:maven-surefire-plugin:2.17:test (default-test)
on project hadoop-yarn-server-resourcemanager: There are test failures.
[ERROR] 
[ERROR] Please refer to /home/jenkins/jenkins-slave/workspace/Hadoop-Yarn-trunk-Java8/hadoop-yarn-project/hadoop-yarn/hadoop-yarn-server/hadoop-yarn-server-resourcemanager/target/surefire-reports
for the individual test results.
[ERROR] -> [Help 1]
[ERROR] 
[ERROR] To see the full stack trace of the errors, re-run Maven with the -e switch.
[ERROR] Re-run Maven using the -X switch to enable full debug logging.
[ERROR] 
[ERROR] For more information about the errors and possible solutions, please read the following
articles:
[ERROR] [Help 1] http://cwiki.apache.org/confluence/display/MAVEN/MojoFailureException
[ERROR] 
[ERROR] After correcting the problems, you can resume the build with the command
[ERROR]   mvn <goals> -rf :hadoop-yarn-server-resourcemanager
Build step 'Execute shell' marked build as failure
Archiving artifacts
Recording test results
Sending e-mails to: yarn-dev@hadoop.apache.org
Email was triggered for: Failure - Any
Sending email for trigger: Failure - Any



###################################################################################
############################## FAILED TESTS (if any) ##############################
2 tests failed.
FAILED:  org.apache.hadoop.yarn.server.resourcemanager.TestContainerResourceUsage.testUsageAfterAMRestartWithMultipleContainers

Error Message:
Unexcpected MemorySeconds value expected:<-1498057569615> but was:<2157>

Stack Trace:
java.lang.AssertionError: Unexcpected MemorySeconds value expected:<-1498057569615>
but was:<2157>
	at org.junit.Assert.fail(Assert.java:88)
	at org.junit.Assert.failNotEquals(Assert.java:743)
	at org.junit.Assert.assertEquals(Assert.java:118)
	at org.junit.Assert.assertEquals(Assert.java:555)
	at org.apache.hadoop.yarn.server.resourcemanager.TestContainerResourceUsage.amRestartTests(TestContainerResourceUsage.java:395)
	at org.apache.hadoop.yarn.server.resourcemanager.TestContainerResourceUsage.testUsageAfterAMRestartWithMultipleContainers(TestContainerResourceUsage.java:252)


FAILED:  org.apache.hadoop.yarn.server.resourcemanager.scheduler.fifo.TestFifoScheduler.testResourceOverCommit

Error Message:
null

Stack Trace:
java.lang.NullPointerException: null
	at org.apache.hadoop.yarn.server.resourcemanager.scheduler.fifo.TestFifoScheduler.testResourceOverCommit(TestFifoScheduler.java:1143)




Mime
View raw message