hadoop-yarn-dev mailing list archives

Site index · List index
Message view « Date » · « Thread »
Top « Date » · « Thread »
From Apache Jenkins Server <jenk...@builds.apache.org>
Subject Hadoop-Yarn-trunk-Java8 - Build # 1485 - Failure
Date Mon, 23 May 2016 23:00:18 GMT
See https://builds.apache.org/job/Hadoop-Yarn-trunk-Java8/1485/

###################################################################################
########################## LAST 60 LINES OF THE CONSOLE ###########################
[...truncated 51638 lines...]
[INFO] Reactor Summary:
[INFO] 
[INFO] Apache Hadoop YARN ................................. SUCCESS [  3.700 s]
[INFO] Apache Hadoop YARN API ............................. SUCCESS [01:48 min]
[INFO] Apache Hadoop YARN Common .......................... SUCCESS [02:58 min]
[INFO] Apache Hadoop YARN Server .......................... SUCCESS [  0.064 s]
[INFO] Apache Hadoop YARN Server Common ................... SUCCESS [ 38.615 s]
[INFO] Apache Hadoop YARN NodeManager ..................... SUCCESS [11:50 min]
[INFO] Apache Hadoop YARN Web Proxy ....................... SUCCESS [ 19.384 s]
[INFO] Apache Hadoop YARN ApplicationHistoryService ....... SUCCESS [03:09 min]
[INFO] Apache Hadoop YARN ResourceManager ................. FAILURE [34:06 min]
[INFO] Apache Hadoop YARN Server Tests .................... SKIPPED
[INFO] Apache Hadoop YARN Client .......................... SKIPPED
[INFO] Apache Hadoop YARN SharedCacheManager .............. SKIPPED
[INFO] Apache Hadoop YARN Timeline Plugin Storage ......... SKIPPED
[INFO] Apache Hadoop YARN Applications .................... SUCCESS [  0.091 s]
[INFO] Apache Hadoop YARN DistributedShell ................ SKIPPED
[INFO] Apache Hadoop YARN Unmanaged Am Launcher ........... SKIPPED
[INFO] Apache Hadoop YARN Site ............................ SUCCESS [  0.121 s]
[INFO] Apache Hadoop YARN Registry ........................ SUCCESS [01:03 min]
[INFO] Apache Hadoop YARN Project ......................... SKIPPED
[INFO] ------------------------------------------------------------------------
[INFO] BUILD FAILURE
[INFO] ------------------------------------------------------------------------
[INFO] Total time: 56:01 min
[INFO] Finished at: 2016-05-23T22:59:19+00:00
[INFO] Final Memory: 127M/4625M
[INFO] ------------------------------------------------------------------------
[WARNING] The requested profile "docs" could not be activated because it does not exist.
[WARNING] The requested profile "parallel-tests" could not be activated because it does not
exist.
[ERROR] Failed to execute goal org.apache.maven.plugins:maven-surefire-plugin:2.17:test (default-test)
on project hadoop-yarn-server-resourcemanager: There are test failures.
[ERROR] 
[ERROR] Please refer to /home/jenkins/jenkins-slave/workspace/Hadoop-Yarn-trunk-Java8/source/hadoop-yarn-project/hadoop-yarn/hadoop-yarn-server/hadoop-yarn-server-resourcemanager/target/surefire-reports
for the individual test results.
[ERROR] -> [Help 1]
[ERROR] 
[ERROR] To see the full stack trace of the errors, re-run Maven with the -e switch.
[ERROR] Re-run Maven using the -X switch to enable full debug logging.
[ERROR] 
[ERROR] For more information about the errors and possible solutions, please read the following
articles:
[ERROR] [Help 1] http://cwiki.apache.org/confluence/display/MAVEN/MojoFailureException
[ERROR] 
[ERROR] After correcting the problems, you can resume the build with the command
[ERROR]   mvn <goals> -rf :hadoop-yarn-server-resourcemanager
Build step 'Execute shell' marked build as failure
Archiving artifacts
Setting LATEST1_8_HOME=/home/jenkins/jenkins-slave/tools/hudson.model.JDK/latest1.8
Setting MAVEN_3_3_3_HOME=/home/jenkins/jenkins-slave/tools/hudson.tasks.Maven_MavenInstallation/maven-3.3.3
Recording test results
Setting LATEST1_8_HOME=/home/jenkins/jenkins-slave/tools/hudson.model.JDK/latest1.8
Setting MAVEN_3_3_3_HOME=/home/jenkins/jenkins-slave/tools/hudson.tasks.Maven_MavenInstallation/maven-3.3.3
Setting LATEST1_8_HOME=/home/jenkins/jenkins-slave/tools/hudson.model.JDK/latest1.8
Setting MAVEN_3_3_3_HOME=/home/jenkins/jenkins-slave/tools/hudson.tasks.Maven_MavenInstallation/maven-3.3.3
Sending e-mails to: yarn-dev@hadoop.apache.org
Email was triggered for: Failure - Any
Sending email for trigger: Failure - Any
Setting LATEST1_8_HOME=/home/jenkins/jenkins-slave/tools/hudson.model.JDK/latest1.8
Setting MAVEN_3_3_3_HOME=/home/jenkins/jenkins-slave/tools/hudson.tasks.Maven_MavenInstallation/maven-3.3.3
Setting LATEST1_8_HOME=/home/jenkins/jenkins-slave/tools/hudson.model.JDK/latest1.8
Setting MAVEN_3_3_3_HOME=/home/jenkins/jenkins-slave/tools/hudson.tasks.Maven_MavenInstallation/maven-3.3.3



###################################################################################
############################## FAILED TESTS (if any) ##############################
2 tests failed.
FAILED:  org.apache.hadoop.yarn.server.resourcemanager.scheduler.capacity.TestApplicationPriority.testPriorityWithPendingApplications

Error Message:
Attempt state is not correct (timeout). expected:<ALLOCATED> but was:<SCHEDULED>

Stack Trace:
java.lang.AssertionError: Attempt state is not correct (timeout). expected:<ALLOCATED>
but was:<SCHEDULED>
	at org.junit.Assert.fail(Assert.java:88)
	at org.junit.Assert.failNotEquals(Assert.java:743)
	at org.junit.Assert.assertEquals(Assert.java:118)
	at org.apache.hadoop.yarn.server.resourcemanager.MockRM.waitForState(MockRM.java:266)
	at org.apache.hadoop.yarn.server.resourcemanager.MockRM.waitForState(MockRM.java:225)
	at org.apache.hadoop.yarn.server.resourcemanager.MockRM.waitForState(MockRM.java:207)
	at org.apache.hadoop.yarn.server.resourcemanager.MockRM.sendAMLaunched(MockRM.java:746)
	at org.apache.hadoop.yarn.server.resourcemanager.MockRM.launchAM(MockRM.java:945)
	at org.apache.hadoop.yarn.server.resourcemanager.scheduler.capacity.TestApplicationPriority.testPriorityWithPendingApplications(TestApplicationPriority.java:285)


FAILED:  org.apache.hadoop.yarn.server.resourcemanager.security.TestDelegationTokenRenewer.testCancelWithMultipleAppSubmissions

Error Message:
null

Stack Trace:
java.lang.AssertionError: null
	at org.junit.Assert.fail(Assert.java:86)
	at org.junit.Assert.assertTrue(Assert.java:41)
	at org.junit.Assert.assertFalse(Assert.java:64)
	at org.junit.Assert.assertFalse(Assert.java:74)
	at org.apache.hadoop.yarn.server.resourcemanager.security.TestDelegationTokenRenewer.testCancelWithMultipleAppSubmissions(TestDelegationTokenRenewer.java:1156)




Mime
View raw message