hadoop-yarn-dev mailing list archives

Site index · List index
Message view « Date » · « Thread »
Top « Date » · « Thread »
From Apache Jenkins Server <jenk...@builds.apache.org>
Subject Hadoop-Yarn-trunk-Java8 - Build # 1487 - Still Failing
Date Tue, 24 May 2016 01:51:38 GMT
See https://builds.apache.org/job/Hadoop-Yarn-trunk-Java8/1487/

###################################################################################
########################## LAST 60 LINES OF THE CONSOLE ###########################
[...truncated 57728 lines...]
[INFO] Reactor Summary:
[INFO] 
[INFO] Apache Hadoop YARN ................................. SUCCESS [  2.943 s]
[INFO] Apache Hadoop YARN API ............................. SUCCESS [01:48 min]
[INFO] Apache Hadoop YARN Common .......................... SUCCESS [02:53 min]
[INFO] Apache Hadoop YARN Server .......................... SUCCESS [  0.055 s]
[INFO] Apache Hadoop YARN Server Common ................... SUCCESS [ 39.409 s]
[INFO] Apache Hadoop YARN NodeManager ..................... SUCCESS [11:41 min]
[INFO] Apache Hadoop YARN Web Proxy ....................... SUCCESS [ 18.795 s]
[INFO] Apache Hadoop YARN ApplicationHistoryService ....... SUCCESS [03:05 min]
[INFO] Apache Hadoop YARN ResourceManager ................. SUCCESS [30:42 min]
[INFO] Apache Hadoop YARN Server Tests .................... SUCCESS [02:16 min]
[INFO] Apache Hadoop YARN Client .......................... FAILURE [07:30 min]
[INFO] Apache Hadoop YARN SharedCacheManager .............. SKIPPED
[INFO] Apache Hadoop YARN Timeline Plugin Storage ......... SKIPPED
[INFO] Apache Hadoop YARN Applications .................... SUCCESS [  0.038 s]
[INFO] Apache Hadoop YARN DistributedShell ................ SKIPPED
[INFO] Apache Hadoop YARN Unmanaged Am Launcher ........... SKIPPED
[INFO] Apache Hadoop YARN Site ............................ SUCCESS [  0.039 s]
[INFO] Apache Hadoop YARN Registry ........................ SUCCESS [ 48.239 s]
[INFO] Apache Hadoop YARN Project ......................... SKIPPED
[INFO] ------------------------------------------------------------------------
[INFO] BUILD FAILURE
[INFO] ------------------------------------------------------------------------
[INFO] Total time: 01:01 h
[INFO] Finished at: 2016-05-24T01:50:31+00:00
[INFO] Final Memory: 142M/4556M
[INFO] ------------------------------------------------------------------------
[WARNING] The requested profile "docs" could not be activated because it does not exist.
[WARNING] The requested profile "parallel-tests" could not be activated because it does not
exist.
[ERROR] Failed to execute goal org.apache.maven.plugins:maven-surefire-plugin:2.17:test (default-test)
on project hadoop-yarn-client: There are test failures.
[ERROR] 
[ERROR] Please refer to /home/jenkins/jenkins-slave/workspace/Hadoop-Yarn-trunk-Java8/source/hadoop-yarn-project/hadoop-yarn/hadoop-yarn-client/target/surefire-reports
for the individual test results.
[ERROR] -> [Help 1]
[ERROR] 
[ERROR] To see the full stack trace of the errors, re-run Maven with the -e switch.
[ERROR] Re-run Maven using the -X switch to enable full debug logging.
[ERROR] 
[ERROR] For more information about the errors and possible solutions, please read the following
articles:
[ERROR] [Help 1] http://cwiki.apache.org/confluence/display/MAVEN/MojoFailureException
[ERROR] 
[ERROR] After correcting the problems, you can resume the build with the command
[ERROR]   mvn <goals> -rf :hadoop-yarn-client
Build step 'Execute shell' marked build as failure
Archiving artifacts
Setting LATEST1_8_HOME=/home/jenkins/jenkins-slave/tools/hudson.model.JDK/latest1.8
Setting MAVEN_3_3_3_HOME=/home/jenkins/jenkins-slave/tools/hudson.tasks.Maven_MavenInstallation/maven-3.3.3
Recording test results
Setting LATEST1_8_HOME=/home/jenkins/jenkins-slave/tools/hudson.model.JDK/latest1.8
Setting MAVEN_3_3_3_HOME=/home/jenkins/jenkins-slave/tools/hudson.tasks.Maven_MavenInstallation/maven-3.3.3
Setting LATEST1_8_HOME=/home/jenkins/jenkins-slave/tools/hudson.model.JDK/latest1.8
Setting MAVEN_3_3_3_HOME=/home/jenkins/jenkins-slave/tools/hudson.tasks.Maven_MavenInstallation/maven-3.3.3
Sending e-mails to: yarn-dev@hadoop.apache.org
Email was triggered for: Failure - Any
Sending email for trigger: Failure - Any
Setting LATEST1_8_HOME=/home/jenkins/jenkins-slave/tools/hudson.model.JDK/latest1.8
Setting MAVEN_3_3_3_HOME=/home/jenkins/jenkins-slave/tools/hudson.tasks.Maven_MavenInstallation/maven-3.3.3
Setting LATEST1_8_HOME=/home/jenkins/jenkins-slave/tools/hudson.model.JDK/latest1.8
Setting MAVEN_3_3_3_HOME=/home/jenkins/jenkins-slave/tools/hudson.tasks.Maven_MavenInstallation/maven-3.3.3



###################################################################################
############################## FAILED TESTS (if any) ##############################
1 tests failed.
FAILED:  org.apache.hadoop.yarn.client.api.impl.TestYarnClient.testReservationAPIs

Error Message:
org.apache.hadoop.yarn.server.resourcemanager.reservation.exceptions.PlanningException: The
request cannot be satisfied
 at org.apache.hadoop.yarn.ipc.RPCUtil.getRemoteException(RPCUtil.java:38)
 at org.apache.hadoop.yarn.server.resourcemanager.ClientRMService.submitReservation(ClientRMService.java:1257)
 at org.apache.hadoop.yarn.api.impl.pb.service.ApplicationClientProtocolPBServiceImpl.submitReservation(ApplicationClientProtocolPBServiceImpl.java:457)
 at org.apache.hadoop.yarn.proto.ApplicationClientProtocol$ApplicationClientProtocolService$2.callBlockingMethod(ApplicationClientProtocol.java:515)
 at org.apache.hadoop.ipc.ProtobufRpcEngine$Server$ProtoBufRpcInvoker.call(ProtobufRpcEngine.java:661)
 at org.apache.hadoop.ipc.RPC$Server.call(RPC.java:989)
 at org.apache.hadoop.ipc.Server$Handler$1.run(Server.java:2423)
 at org.apache.hadoop.ipc.Server$Handler$1.run(Server.java:2419)
 at java.security.AccessController.doPrivileged(Native Method)
 at javax.security.auth.Subject.doAs(Subject.java:422)
 at org.apache.hadoop.security.UserGroupInformation.doAs(UserGroupInformation.java:1755)
 at org.apache.hadoop.ipc.Server$Handler.run(Server.java:2419)
Caused by: org.apache.hadoop.yarn.server.resourcemanager.reservation.exceptions.PlanningException:
The request cannot be satisfied
 at org.apache.hadoop.yarn.server.resourcemanager.reservation.planning.IterativePlanner.computeJobAllocation(IterativePlanner.java:151)
 at org.apache.hadoop.yarn.server.resourcemanager.reservation.planning.PlanningAlgorithm.allocateUser(PlanningAlgorithm.java:65)
 at org.apache.hadoop.yarn.server.resourcemanager.reservation.planning.PlanningAlgorithm.createReservation(PlanningAlgorithm.java:140)
 at org.apache.hadoop.yarn.server.resourcemanager.reservation.planning.TryManyReservationAgents.createReservation(TryManyReservationAgents.java:55)
 at org.apache.hadoop.yarn.server.resourcemanager.reservation.planning.AlignedPlannerWithGreedy.createReservation(AlignedPlannerWithGreedy.java:85)
 at org.apache.hadoop.yarn.server.resourcemanager.ClientRMService.submitReservation(ClientRMService.java:1241)
 ... 10 more


Stack Trace:
java.lang.AssertionError: org.apache.hadoop.yarn.server.resourcemanager.reservation.exceptions.PlanningException:
The request cannot be satisfied
	at org.apache.hadoop.yarn.ipc.RPCUtil.getRemoteException(RPCUtil.java:38)
	at org.apache.hadoop.yarn.server.resourcemanager.ClientRMService.submitReservation(ClientRMService.java:1257)
	at org.apache.hadoop.yarn.api.impl.pb.service.ApplicationClientProtocolPBServiceImpl.submitReservation(ApplicationClientProtocolPBServiceImpl.java:457)
	at org.apache.hadoop.yarn.proto.ApplicationClientProtocol$ApplicationClientProtocolService$2.callBlockingMethod(ApplicationClientProtocol.java:515)
	at org.apache.hadoop.ipc.ProtobufRpcEngine$Server$ProtoBufRpcInvoker.call(ProtobufRpcEngine.java:661)
	at org.apache.hadoop.ipc.RPC$Server.call(RPC.java:989)
	at org.apache.hadoop.ipc.Server$Handler$1.run(Server.java:2423)
	at org.apache.hadoop.ipc.Server$Handler$1.run(Server.java:2419)
	at java.security.AccessController.doPrivileged(Native Method)
	at javax.security.auth.Subject.doAs(Subject.java:422)
	at org.apache.hadoop.security.UserGroupInformation.doAs(UserGroupInformation.java:1755)
	at org.apache.hadoop.ipc.Server$Handler.run(Server.java:2419)
Caused by: org.apache.hadoop.yarn.server.resourcemanager.reservation.exceptions.PlanningException:
The request cannot be satisfied
	at org.apache.hadoop.yarn.server.resourcemanager.reservation.planning.IterativePlanner.computeJobAllocation(IterativePlanner.java:151)
	at org.apache.hadoop.yarn.server.resourcemanager.reservation.planning.PlanningAlgorithm.allocateUser(PlanningAlgorithm.java:65)
	at org.apache.hadoop.yarn.server.resourcemanager.reservation.planning.PlanningAlgorithm.createReservation(PlanningAlgorithm.java:140)
	at org.apache.hadoop.yarn.server.resourcemanager.reservation.planning.TryManyReservationAgents.createReservation(TryManyReservationAgents.java:55)
	at org.apache.hadoop.yarn.server.resourcemanager.reservation.planning.AlignedPlannerWithGreedy.createReservation(AlignedPlannerWithGreedy.java:85)
	at org.apache.hadoop.yarn.server.resourcemanager.ClientRMService.submitReservation(ClientRMService.java:1241)
	... 10 more

	at org.junit.Assert.fail(Assert.java:88)
	at org.apache.hadoop.yarn.client.api.impl.TestYarnClient.testReservationAPIs(TestYarnClient.java:1230)




Mime
View raw message