hadoop-yarn-dev mailing list archives

Site index · List index
Message view « Date » · « Thread »
Top « Date » · « Thread »
From Apache Jenkins Server <jenk...@builds.apache.org>
Subject Hadoop-Yarn-trunk - Build # 2142 - Still Failing
Date Fri, 13 May 2016 10:22:32 GMT
See https://builds.apache.org/job/Hadoop-Yarn-trunk/2142/

###################################################################################
########################## LAST 60 LINES OF THE CONSOLE ###########################
[...truncated 8896 lines...]

However, there were other interactions with this mock:
-> at org.apache.hadoop.yarn.server.applicationhistoryservice.TestFileSystemApplicationHistoryStore.initAndStartStore(TestFileSystemApplicationHistoryStore.java:70)


Tests in error: 
  TestFileSystemApplicationHistoryStore.setup:64->initAndStartStore:70 ยป NullPointer
  TestFileSystemApplicationHistoryStore.tearDown:89 NullPointer

Tests run: 202, Failures: 1, Errors: 2, Skipped: 0

[INFO] ------------------------------------------------------------------------
[INFO] Reactor Summary:
[INFO] 
[INFO] Apache Hadoop YARN ................................ SUCCESS [  3.774 s]
[INFO] Apache Hadoop YARN API ............................ SUCCESS [04:28 min]
[INFO] Apache Hadoop YARN Common ......................... SUCCESS [03:15 min]
[INFO] Apache Hadoop YARN Server ......................... SUCCESS [  0.096 s]
[INFO] Apache Hadoop YARN Server Common .................. SUCCESS [ 49.555 s]
[INFO] Apache Hadoop YARN NodeManager .................... SUCCESS [12:03 min]
[INFO] Apache Hadoop YARN Web Proxy ...................... SUCCESS [ 25.829 s]
[INFO] Apache Hadoop YARN ApplicationHistoryService ...... FAILURE [02:55 min]
[INFO] Apache Hadoop YARN ResourceManager ................ SKIPPED
[INFO] Apache Hadoop YARN Server Tests ................... SKIPPED
[INFO] Apache Hadoop YARN Client ......................... SKIPPED
[INFO] Apache Hadoop YARN SharedCacheManager ............. SKIPPED
[INFO] Apache Hadoop YARN Timeline Plugin Storage ........ SKIPPED
[INFO] Apache Hadoop YARN Applications ................... SKIPPED
[INFO] Apache Hadoop YARN DistributedShell ............... SKIPPED
[INFO] Apache Hadoop YARN Unmanaged Am Launcher .......... SKIPPED
[INFO] Apache Hadoop YARN Site ........................... SKIPPED
[INFO] Apache Hadoop YARN Registry ....................... SKIPPED
[INFO] Apache Hadoop YARN Project ........................ SKIPPED
[INFO] ------------------------------------------------------------------------
[INFO] BUILD FAILURE
[INFO] ------------------------------------------------------------------------
[INFO] Total time: 24:03 min
[INFO] Finished at: 2016-05-13T10:22:42+00:00
[INFO] Final Memory: 86M/793M
[INFO] ------------------------------------------------------------------------
[ERROR] Failed to execute goal org.apache.maven.plugins:maven-surefire-plugin:2.17:test (default-test)
on project hadoop-yarn-server-applicationhistoryservice: There are test failures.
[ERROR] 
[ERROR] Please refer to /home/jenkins/jenkins-slave/workspace/Hadoop-Yarn-trunk/hadoop-yarn-project/hadoop-yarn/hadoop-yarn-server/hadoop-yarn-server-applicationhistoryservice/target/surefire-reports
for the individual test results.
[ERROR] -> [Help 1]
[ERROR] 
[ERROR] To see the full stack trace of the errors, re-run Maven with the -e switch.
[ERROR] Re-run Maven using the -X switch to enable full debug logging.
[ERROR] 
[ERROR] For more information about the errors and possible solutions, please read the following
articles:
[ERROR] [Help 1] http://cwiki.apache.org/confluence/display/MAVEN/MojoFailureException
[ERROR] 
[ERROR] After correcting the problems, you can resume the build with the command
[ERROR]   mvn <goals> -rf :hadoop-yarn-server-applicationhistoryservice
Build step 'Execute shell' marked build as failure
Archiving artifacts
Recording test results
Sending e-mails to: yarn-dev@hadoop.apache.org
Email was triggered for: Failure - Any
Sending email for trigger: Failure - Any



###################################################################################
############################## FAILED TESTS (if any) ##############################
3 tests failed.
FAILED:  org.apache.hadoop.yarn.server.applicationhistoryservice.TestFileSystemApplicationHistoryStore.testMissingApplicationAttemptHistoryData

Error Message:
null

Stack Trace:
java.lang.NullPointerException: null
	at java.util.TreeMap.getEntry(TreeMap.java:342)
	at java.util.TreeMap.get(TreeMap.java:273)
	at org.apache.hadoop.fs.GlobalStorageStatistics.put(GlobalStorageStatistics.java:73)
	at org.apache.hadoop.fs.FileSystem.getStatistics(FileSystem.java:3598)
	at org.apache.hadoop.fs.FileSystem.initialize(FileSystem.java:214)
	at org.apache.hadoop.fs.RawLocalFileSystem.initialize(RawLocalFileSystem.java:101)
	at org.apache.hadoop.yarn.server.applicationhistoryservice.TestFileSystemApplicationHistoryStore.initAndStartStore(TestFileSystemApplicationHistoryStore.java:70)
	at org.apache.hadoop.yarn.server.applicationhistoryservice.TestFileSystemApplicationHistoryStore.setup(TestFileSystemApplicationHistoryStore.java:64)


FAILED:  org.apache.hadoop.yarn.server.applicationhistoryservice.TestFileSystemApplicationHistoryStore.testMissingApplicationAttemptHistoryData

Error Message:
null

Stack Trace:
java.lang.NullPointerException: null
	at org.apache.hadoop.yarn.server.applicationhistoryservice.TestFileSystemApplicationHistoryStore.tearDown(TestFileSystemApplicationHistoryStore.java:89)


FAILED:  org.apache.hadoop.yarn.server.applicationhistoryservice.TestFileSystemApplicationHistoryStore.testInitNonExistingWorkingDirectoryInSafeMode

Error Message:

Wanted but not invoked:
rawLocalFileSystem.isDirectory(<any>);
-> at org.apache.hadoop.yarn.server.applicationhistoryservice.TestFileSystemApplicationHistoryStore.testInitNonExistingWorkingDirectoryInSafeMode(TestFileSystemApplicationHistoryStore.java:304)

However, there were other interactions with this mock:
-> at org.apache.hadoop.yarn.server.applicationhistoryservice.TestFileSystemApplicationHistoryStore.initAndStartStore(TestFileSystemApplicationHistoryStore.java:70)


Stack Trace:
org.mockito.exceptions.verification.WantedButNotInvoked: 
Wanted but not invoked:
rawLocalFileSystem.isDirectory(<any>);
-> at org.apache.hadoop.yarn.server.applicationhistoryservice.TestFileSystemApplicationHistoryStore.testInitNonExistingWorkingDirectoryInSafeMode(TestFileSystemApplicationHistoryStore.java:304)

However, there were other interactions with this mock:
-> at org.apache.hadoop.yarn.server.applicationhistoryservice.TestFileSystemApplicationHistoryStore.initAndStartStore(TestFileSystemApplicationHistoryStore.java:70)

	at org.apache.hadoop.yarn.server.applicationhistoryservice.TestFileSystemApplicationHistoryStore.testInitNonExistingWorkingDirectoryInSafeMode(TestFileSystemApplicationHistoryStore.java:304)




Mime
View raw message