hadoop-yarn-dev mailing list archives

Site index · List index
Message view « Date » · « Thread »
Top « Date » · « Thread »
From Apache Jenkins Server <jenk...@builds.apache.org>
Subject Build failed in Jenkins: Hadoop-Yarn-trunk #2092
Date Mon, 02 May 2016 18:44:19 GMT
See <https://builds.apache.org/job/Hadoop-Yarn-trunk/2092/changes>

Changes:

[cmccabe] HADOOP-13072. WindowsGetSpaceUsed constructor should be public

------------------------------------------
[...truncated 9282 lines...]
Running org.apache.hadoop.yarn.server.resourcemanager.reservation.TestCapacityOverTimePolicy
Tests run: 8, Failures: 0, Errors: 0, Skipped: 0, Time elapsed: 4.05 sec - in org.apache.hadoop.yarn.server.resourcemanager.reservation.TestCapacityOverTimePolicy
Running org.apache.hadoop.yarn.server.resourcemanager.reservation.TestReservationInputValidator
Tests run: 28, Failures: 0, Errors: 0, Skipped: 0, Time elapsed: 0.888 sec - in org.apache.hadoop.yarn.server.resourcemanager.reservation.TestReservationInputValidator
Running org.apache.hadoop.yarn.server.resourcemanager.reservation.TestNoOverCommitPolicy
Tests run: 6, Failures: 0, Errors: 0, Skipped: 0, Time elapsed: 1.664 sec - in org.apache.hadoop.yarn.server.resourcemanager.reservation.TestNoOverCommitPolicy
Running org.apache.hadoop.yarn.server.resourcemanager.reservation.TestInMemoryPlan
Tests run: 14, Failures: 0, Errors: 0, Skipped: 0, Time elapsed: 0.959 sec - in org.apache.hadoop.yarn.server.resourcemanager.reservation.TestInMemoryPlan
Running org.apache.hadoop.yarn.server.resourcemanager.reservation.TestInMemoryReservationAllocation
Tests run: 5, Failures: 0, Errors: 0, Skipped: 0, Time elapsed: 0.573 sec - in org.apache.hadoop.yarn.server.resourcemanager.reservation.TestInMemoryReservationAllocation
Running org.apache.hadoop.yarn.server.resourcemanager.reservation.TestFairSchedulerPlanFollower
Tests run: 2, Failures: 0, Errors: 0, Skipped: 0, Time elapsed: 2.305 sec - in org.apache.hadoop.yarn.server.resourcemanager.reservation.TestFairSchedulerPlanFollower
Running org.apache.hadoop.yarn.server.resourcemanager.reservation.TestCapacitySchedulerPlanFollower
Tests run: 2, Failures: 0, Errors: 0, Skipped: 0, Time elapsed: 2.553 sec - in org.apache.hadoop.yarn.server.resourcemanager.reservation.TestCapacitySchedulerPlanFollower
Running org.apache.hadoop.yarn.server.resourcemanager.reservation.TestRLESparseResourceAllocation
Tests run: 12, Failures: 0, Errors: 0, Skipped: 1, Time elapsed: 0.559 sec - in org.apache.hadoop.yarn.server.resourcemanager.reservation.TestRLESparseResourceAllocation
Running org.apache.hadoop.yarn.server.resourcemanager.reservation.TestReservationSystemUtil
Tests run: 4, Failures: 0, Errors: 0, Skipped: 0, Time elapsed: 0.718 sec - in org.apache.hadoop.yarn.server.resourcemanager.reservation.TestReservationSystemUtil
Running org.apache.hadoop.yarn.server.resourcemanager.reservation.TestReservationSystem
Tests run: 2, Failures: 0, Errors: 0, Skipped: 0, Time elapsed: 2.637 sec - in org.apache.hadoop.yarn.server.resourcemanager.reservation.TestReservationSystem
Running org.apache.hadoop.yarn.server.resourcemanager.reservation.planning.TestGreedyReservationAgent
Tests run: 20, Failures: 0, Errors: 0, Skipped: 0, Time elapsed: 2.44 sec - in org.apache.hadoop.yarn.server.resourcemanager.reservation.planning.TestGreedyReservationAgent
Running org.apache.hadoop.yarn.server.resourcemanager.reservation.planning.TestAlignedPlanner
Tests run: 13, Failures: 0, Errors: 0, Skipped: 0, Time elapsed: 2.098 sec - in org.apache.hadoop.yarn.server.resourcemanager.reservation.planning.TestAlignedPlanner
Running org.apache.hadoop.yarn.server.resourcemanager.reservation.planning.TestSimpleCapacityReplanner
Tests run: 1, Failures: 0, Errors: 0, Skipped: 0, Time elapsed: 0.929 sec - in org.apache.hadoop.yarn.server.resourcemanager.reservation.planning.TestSimpleCapacityReplanner
Running org.apache.hadoop.yarn.server.resourcemanager.blacklist.TestBlacklistManager
Tests run: 3, Failures: 0, Errors: 0, Skipped: 0, Time elapsed: 0.186 sec - in org.apache.hadoop.yarn.server.resourcemanager.blacklist.TestBlacklistManager
Running org.apache.hadoop.yarn.server.resourcemanager.TestRMEmbeddedElector
Tests run: 1, Failures: 0, Errors: 0, Skipped: 0, Time elapsed: 3.292 sec - in org.apache.hadoop.yarn.server.resourcemanager.TestRMEmbeddedElector
Running org.apache.hadoop.yarn.server.resourcemanager.scheduler.TestAbstractYarnScheduler
Tests run: 8, Failures: 0, Errors: 0, Skipped: 0, Time elapsed: 5.363 sec - in org.apache.hadoop.yarn.server.resourcemanager.scheduler.TestAbstractYarnScheduler
Running org.apache.hadoop.yarn.server.resourcemanager.scheduler.fifo.TestFifoScheduler
Tests run: 17, Failures: 0, Errors: 0, Skipped: 0, Time elapsed: 9.826 sec - in org.apache.hadoop.yarn.server.resourcemanager.scheduler.fifo.TestFifoScheduler
Running org.apache.hadoop.yarn.server.resourcemanager.scheduler.policy.TestFifoOrderingPolicyForPendingApps
Tests run: 2, Failures: 0, Errors: 0, Skipped: 0, Time elapsed: 0.518 sec - in org.apache.hadoop.yarn.server.resourcemanager.scheduler.policy.TestFifoOrderingPolicyForPendingApps
Running org.apache.hadoop.yarn.server.resourcemanager.scheduler.policy.TestFairOrderingPolicy
Tests run: 4, Failures: 0, Errors: 0, Skipped: 0, Time elapsed: 2.589 sec - in org.apache.hadoop.yarn.server.resourcemanager.scheduler.policy.TestFairOrderingPolicy
Running org.apache.hadoop.yarn.server.resourcemanager.scheduler.policy.TestFifoOrderingPolicy
Tests run: 3, Failures: 0, Errors: 0, Skipped: 0, Time elapsed: 0.52 sec - in org.apache.hadoop.yarn.server.resourcemanager.scheduler.policy.TestFifoOrderingPolicy
Running org.apache.hadoop.yarn.server.resourcemanager.scheduler.fair.TestFairSchedulerFairShare
Tests run: 6, Failures: 0, Errors: 0, Skipped: 0, Time elapsed: 3.995 sec - in org.apache.hadoop.yarn.server.resourcemanager.scheduler.fair.TestFairSchedulerFairShare
Running org.apache.hadoop.yarn.server.resourcemanager.scheduler.fair.TestAllocationFileLoaderService
Tests run: 11, Failures: 0, Errors: 0, Skipped: 0, Time elapsed: 1.04 sec - in org.apache.hadoop.yarn.server.resourcemanager.scheduler.fair.TestAllocationFileLoaderService
Running org.apache.hadoop.yarn.server.resourcemanager.scheduler.fair.TestFairSchedulerQueueACLs
Tests run: 1, Failures: 0, Errors: 0, Skipped: 0, Time elapsed: 4.601 sec - in org.apache.hadoop.yarn.server.resourcemanager.scheduler.fair.TestFairSchedulerQueueACLs
Running org.apache.hadoop.yarn.server.resourcemanager.scheduler.fair.TestContinuousScheduling
Tests run: 2, Failures: 0, Errors: 0, Skipped: 0, Time elapsed: 2.585 sec - in org.apache.hadoop.yarn.server.resourcemanager.scheduler.fair.TestContinuousScheduling
Running org.apache.hadoop.yarn.server.resourcemanager.scheduler.fair.TestFairSchedulerConfiguration
Tests run: 5, Failures: 0, Errors: 0, Skipped: 0, Time elapsed: 0.544 sec - in org.apache.hadoop.yarn.server.resourcemanager.scheduler.fair.TestFairSchedulerConfiguration
Running org.apache.hadoop.yarn.server.resourcemanager.scheduler.fair.TestMaxRunningAppsEnforcer
Tests run: 6, Failures: 0, Errors: 0, Skipped: 0, Time elapsed: 1.557 sec - in org.apache.hadoop.yarn.server.resourcemanager.scheduler.fair.TestMaxRunningAppsEnforcer
Running org.apache.hadoop.yarn.server.resourcemanager.scheduler.fair.TestFSLeafQueue
Tests run: 5, Failures: 0, Errors: 0, Skipped: 0, Time elapsed: 3.288 sec - in org.apache.hadoop.yarn.server.resourcemanager.scheduler.fair.TestFSLeafQueue
Running org.apache.hadoop.yarn.server.resourcemanager.scheduler.fair.TestSchedulingUpdate
Tests run: 1, Failures: 0, Errors: 0, Skipped: 0, Time elapsed: 1.869 sec - in org.apache.hadoop.yarn.server.resourcemanager.scheduler.fair.TestSchedulingUpdate
Running org.apache.hadoop.yarn.server.resourcemanager.scheduler.fair.TestFairSchedulerEventLog
Tests run: 1, Failures: 0, Errors: 0, Skipped: 0, Time elapsed: 1.814 sec - in org.apache.hadoop.yarn.server.resourcemanager.scheduler.fair.TestFairSchedulerEventLog
Running org.apache.hadoop.yarn.server.resourcemanager.scheduler.fair.TestFairScheduler
Tests run: 83, Failures: 0, Errors: 0, Skipped: 0, Time elapsed: 13.877 sec - in org.apache.hadoop.yarn.server.resourcemanager.scheduler.fair.TestFairScheduler
Running org.apache.hadoop.yarn.server.resourcemanager.scheduler.fair.TestComputeFairShares
Tests run: 9, Failures: 0, Errors: 0, Skipped: 0, Time elapsed: 0.54 sec - in org.apache.hadoop.yarn.server.resourcemanager.scheduler.fair.TestComputeFairShares
Running org.apache.hadoop.yarn.server.resourcemanager.scheduler.fair.TestFairSchedulerPreemption
Tests run: 10, Failures: 0, Errors: 0, Skipped: 0, Time elapsed: 5.504 sec - in org.apache.hadoop.yarn.server.resourcemanager.scheduler.fair.TestFairSchedulerPreemption
Running org.apache.hadoop.yarn.server.resourcemanager.scheduler.fair.TestAppRunnability
Tests run: 8, Failures: 0, Errors: 0, Skipped: 0, Time elapsed: 3.904 sec - in org.apache.hadoop.yarn.server.resourcemanager.scheduler.fair.TestAppRunnability
Running org.apache.hadoop.yarn.server.resourcemanager.scheduler.fair.TestSchedulingPolicy
Tests run: 2, Failures: 0, Errors: 0, Skipped: 0, Time elapsed: 0.706 sec - in org.apache.hadoop.yarn.server.resourcemanager.scheduler.fair.TestSchedulingPolicy
Running org.apache.hadoop.yarn.server.resourcemanager.scheduler.fair.TestQueueManager
Tests run: 3, Failures: 0, Errors: 0, Skipped: 0, Time elapsed: 1.282 sec - in org.apache.hadoop.yarn.server.resourcemanager.scheduler.fair.TestQueueManager
Running org.apache.hadoop.yarn.server.resourcemanager.scheduler.fair.TestFSParentQueue
Tests run: 1, Failures: 0, Errors: 0, Skipped: 0, Time elapsed: 1.117 sec - in org.apache.hadoop.yarn.server.resourcemanager.scheduler.fair.TestFSParentQueue
Running org.apache.hadoop.yarn.server.resourcemanager.scheduler.fair.policies.TestEmptyQueues
Tests run: 3, Failures: 0, Errors: 0, Skipped: 0, Time elapsed: 0.534 sec - in org.apache.hadoop.yarn.server.resourcemanager.scheduler.fair.policies.TestEmptyQueues
Running org.apache.hadoop.yarn.server.resourcemanager.scheduler.fair.policies.TestDominantResourceFairnessPolicy
Tests run: 9, Failures: 0, Errors: 0, Skipped: 0, Time elapsed: 0.542 sec - in org.apache.hadoop.yarn.server.resourcemanager.scheduler.fair.policies.TestDominantResourceFairnessPolicy
Running org.apache.hadoop.yarn.server.resourcemanager.scheduler.fair.TestFSAppAttempt
Tests run: 5, Failures: 0, Errors: 0, Skipped: 0, Time elapsed: 2.825 sec - in org.apache.hadoop.yarn.server.resourcemanager.scheduler.fair.TestFSAppAttempt
Running org.apache.hadoop.yarn.server.resourcemanager.scheduler.fair.TestQueuePlacementPolicy
Tests run: 17, Failures: 0, Errors: 0, Skipped: 0, Time elapsed: 0.739 sec - in org.apache.hadoop.yarn.server.resourcemanager.scheduler.fair.TestQueuePlacementPolicy
Running org.apache.hadoop.yarn.server.resourcemanager.scheduler.TestSchedulerUtils
Tests run: 9, Failures: 0, Errors: 0, Skipped: 0, Time elapsed: 3.958 sec - in org.apache.hadoop.yarn.server.resourcemanager.scheduler.TestSchedulerUtils
Running org.apache.hadoop.yarn.server.resourcemanager.scheduler.TestAppSchedulingInfo
Tests run: 1, Failures: 0, Errors: 0, Skipped: 0, Time elapsed: 0.701 sec - in org.apache.hadoop.yarn.server.resourcemanager.scheduler.TestAppSchedulingInfo
Running org.apache.hadoop.yarn.server.resourcemanager.scheduler.TestQueueMetrics
Tests run: 8, Failures: 0, Errors: 0, Skipped: 0, Time elapsed: 3.129 sec - in org.apache.hadoop.yarn.server.resourcemanager.scheduler.TestQueueMetrics
Running org.apache.hadoop.yarn.server.resourcemanager.scheduler.TestResourceUsage
Tests run: 7, Failures: 0, Errors: 0, Skipped: 0, Time elapsed: 0.536 sec - in org.apache.hadoop.yarn.server.resourcemanager.scheduler.TestResourceUsage
Running org.apache.hadoop.yarn.server.resourcemanager.scheduler.distributed.TestTopKNodeSelector
Tests run: 2, Failures: 0, Errors: 0, Skipped: 0, Time elapsed: 0.389 sec - in org.apache.hadoop.yarn.server.resourcemanager.scheduler.distributed.TestTopKNodeSelector
Running org.apache.hadoop.yarn.server.resourcemanager.scheduler.capacity.TestCapacitySchedulerNodeLabelUpdate
Tests run: 4, Failures: 0, Errors: 0, Skipped: 0, Time elapsed: 5.61 sec - in org.apache.hadoop.yarn.server.resourcemanager.scheduler.capacity.TestCapacitySchedulerNodeLabelUpdate
Running org.apache.hadoop.yarn.server.resourcemanager.scheduler.capacity.TestApplicationLimits
Tests run: 5, Failures: 0, Errors: 0, Skipped: 0, Time elapsed: 3.274 sec - in org.apache.hadoop.yarn.server.resourcemanager.scheduler.capacity.TestApplicationLimits
Running org.apache.hadoop.yarn.server.resourcemanager.scheduler.capacity.TestReservationQueue
Tests run: 1, Failures: 0, Errors: 0, Skipped: 0, Time elapsed: 1.676 sec - in org.apache.hadoop.yarn.server.resourcemanager.scheduler.capacity.TestReservationQueue
Running org.apache.hadoop.yarn.server.resourcemanager.scheduler.capacity.TestApplicationLimitsByPartition
Tests run: 6, Failures: 0, Errors: 0, Skipped: 0, Time elapsed: 7.292 sec - in org.apache.hadoop.yarn.server.resourcemanager.scheduler.capacity.TestApplicationLimitsByPartition
Running org.apache.hadoop.yarn.server.resourcemanager.scheduler.capacity.TestNodeLabelContainerAllocation
Tests run: 17, Failures: 0, Errors: 0, Skipped: 0, Time elapsed: 118.377 sec - in org.apache.hadoop.yarn.server.resourcemanager.scheduler.capacity.TestNodeLabelContainerAllocation
Running org.apache.hadoop.yarn.server.resourcemanager.scheduler.capacity.TestWorkPreservingRMRestartForNodeLabel
Tests run: 1, Failures: 0, Errors: 0, Skipped: 0, Time elapsed: 3.956 sec - in org.apache.hadoop.yarn.server.resourcemanager.scheduler.capacity.TestWorkPreservingRMRestartForNodeLabel
Running org.apache.hadoop.yarn.server.resourcemanager.scheduler.capacity.TestContainerAllocation
Tests run: 8, Failures: 0, Errors: 0, Skipped: 0, Time elapsed: 19.184 sec - in org.apache.hadoop.yarn.server.resourcemanager.scheduler.capacity.TestContainerAllocation
Running org.apache.hadoop.yarn.server.resourcemanager.scheduler.capacity.TestCapacitySchedulerPreemption
Tests run: 6, Failures: 0, Errors: 0, Skipped: 1, Time elapsed: 4.851 sec - in org.apache.hadoop.yarn.server.resourcemanager.scheduler.capacity.TestCapacitySchedulerPreemption
Running org.apache.hadoop.yarn.server.resourcemanager.scheduler.capacity.TestApplicationPriority
Tests run: 9, Failures: 0, Errors: 0, Skipped: 0, Time elapsed: 12.667 sec - in org.apache.hadoop.yarn.server.resourcemanager.scheduler.capacity.TestApplicationPriority
Running org.apache.hadoop.yarn.server.resourcemanager.scheduler.capacity.TestReservations
Tests run: 10, Failures: 0, Errors: 0, Skipped: 0, Time elapsed: 5.725 sec - in org.apache.hadoop.yarn.server.resourcemanager.scheduler.capacity.TestReservations
Running org.apache.hadoop.yarn.server.resourcemanager.scheduler.capacity.TestCapacitySchedulerQueueACLs
Tests run: 1, Failures: 0, Errors: 0, Skipped: 0, Time elapsed: 4.626 sec - in org.apache.hadoop.yarn.server.resourcemanager.scheduler.capacity.TestCapacitySchedulerQueueACLs
Running org.apache.hadoop.yarn.server.resourcemanager.scheduler.capacity.TestParentQueue
Tests run: 9, Failures: 0, Errors: 0, Skipped: 0, Time elapsed: 4.229 sec - in org.apache.hadoop.yarn.server.resourcemanager.scheduler.capacity.TestParentQueue
Running org.apache.hadoop.yarn.server.resourcemanager.scheduler.capacity.TestCapacitySchedulerDynamicBehavior
Tests run: 4, Failures: 0, Errors: 0, Skipped: 0, Time elapsed: 2.994 sec - in org.apache.hadoop.yarn.server.resourcemanager.scheduler.capacity.TestCapacitySchedulerDynamicBehavior
Running org.apache.hadoop.yarn.server.resourcemanager.scheduler.capacity.TestIncreaseAllocationExpirer
Tests run: 4, Failures: 0, Errors: 0, Skipped: 0, Time elapsed: 48.564 sec - in org.apache.hadoop.yarn.server.resourcemanager.scheduler.capacity.TestIncreaseAllocationExpirer
Running org.apache.hadoop.yarn.server.resourcemanager.scheduler.capacity.TestLeafQueue
Tests run: 30, Failures: 0, Errors: 0, Skipped: 0, Time elapsed: 22.552 sec - in org.apache.hadoop.yarn.server.resourcemanager.scheduler.capacity.TestLeafQueue
Running org.apache.hadoop.yarn.server.resourcemanager.scheduler.capacity.TestQueueMappings
Tests run: 3, Failures: 0, Errors: 0, Skipped: 0, Time elapsed: 2.355 sec - in org.apache.hadoop.yarn.server.resourcemanager.scheduler.capacity.TestQueueMappings
Running org.apache.hadoop.yarn.server.resourcemanager.scheduler.capacity.TestContainerResizing
Tests run: 11, Failures: 0, Errors: 0, Skipped: 0, Time elapsed: 10.728 sec - in org.apache.hadoop.yarn.server.resourcemanager.scheduler.capacity.TestContainerResizing
Running org.apache.hadoop.yarn.server.resourcemanager.scheduler.capacity.TestCapacityScheduler
Tests run: 46, Failures: 0, Errors: 0, Skipped: 0, Time elapsed: 37.79 sec - in org.apache.hadoop.yarn.server.resourcemanager.scheduler.capacity.TestCapacityScheduler
Running org.apache.hadoop.yarn.server.resourcemanager.scheduler.capacity.TestQueueCapacities
Tests run: 9, Failures: 0, Errors: 0, Skipped: 0, Time elapsed: 0.218 sec - in org.apache.hadoop.yarn.server.resourcemanager.scheduler.capacity.TestQueueCapacities
Running org.apache.hadoop.yarn.server.resourcemanager.scheduler.capacity.TestChildQueueOrder
Tests run: 1, Failures: 0, Errors: 0, Skipped: 0, Time elapsed: 2.801 sec - in org.apache.hadoop.yarn.server.resourcemanager.scheduler.capacity.TestChildQueueOrder
Running org.apache.hadoop.yarn.server.resourcemanager.scheduler.capacity.TestQueueParsing
Tests run: 17, Failures: 0, Errors: 0, Skipped: 0, Time elapsed: 3.967 sec - in org.apache.hadoop.yarn.server.resourcemanager.scheduler.capacity.TestQueueParsing
Running org.apache.hadoop.yarn.server.resourcemanager.scheduler.TestSchedulerApplicationAttempt
Tests run: 4, Failures: 0, Errors: 0, Skipped: 0, Time elapsed: 1.232 sec - in org.apache.hadoop.yarn.server.resourcemanager.scheduler.TestSchedulerApplicationAttempt
Running org.apache.hadoop.yarn.server.resourcemanager.scheduler.TestSchedulerHealth
Tests run: 5, Failures: 0, Errors: 0, Skipped: 0, Time elapsed: 2.739 sec - in org.apache.hadoop.yarn.server.resourcemanager.scheduler.TestSchedulerHealth
Running org.apache.hadoop.yarn.server.resourcemanager.TestRMDispatcher
Tests run: 1, Failures: 0, Errors: 0, Skipped: 0, Time elapsed: 1.934 sec - in org.apache.hadoop.yarn.server.resourcemanager.TestRMDispatcher
Running org.apache.hadoop.yarn.server.resourcemanager.TestLeaderElectorService
Tests run: 6, Failures: 0, Errors: 0, Skipped: 0, Time elapsed: 34.924 sec - in org.apache.hadoop.yarn.server.resourcemanager.TestLeaderElectorService
Running org.apache.hadoop.yarn.server.resourcemanager.resource.TestResources
Tests run: 2, Failures: 0, Errors: 0, Skipped: 0, Time elapsed: 0.517 sec - in org.apache.hadoop.yarn.server.resourcemanager.resource.TestResources
Running org.apache.hadoop.yarn.server.resourcemanager.resource.TestResourceWeights
Tests run: 1, Failures: 0, Errors: 0, Skipped: 0, Time elapsed: 0.078 sec - in org.apache.hadoop.yarn.server.resourcemanager.resource.TestResourceWeights
Running org.apache.hadoop.yarn.server.resourcemanager.TestTokenClientRMService
Tests run: 6, Failures: 0, Errors: 0, Skipped: 0, Time elapsed: 1.462 sec - in org.apache.hadoop.yarn.server.resourcemanager.TestTokenClientRMService
Running org.apache.hadoop.yarn.server.resourcemanager.ahs.TestRMApplicationHistoryWriter
Tests run: 7, Failures: 0, Errors: 0, Skipped: 0, Time elapsed: 148.124 sec - in org.apache.hadoop.yarn.server.resourcemanager.ahs.TestRMApplicationHistoryWriter
Running org.apache.hadoop.yarn.server.resourcemanager.webapp.TestAppPage
Tests run: 1, Failures: 0, Errors: 0, Skipped: 0, Time elapsed: 2.438 sec - in org.apache.hadoop.yarn.server.resourcemanager.webapp.TestAppPage
Running org.apache.hadoop.yarn.server.resourcemanager.webapp.TestRMWebApp
Tests run: 3, Failures: 0, Errors: 0, Skipped: 0, Time elapsed: 7.654 sec - in org.apache.hadoop.yarn.server.resourcemanager.webapp.TestRMWebApp
Running org.apache.hadoop.yarn.server.resourcemanager.webapp.TestRMWebServicesCapacitySched
Tests run: 7, Failures: 0, Errors: 0, Skipped: 0, Time elapsed: 8.509 sec - in org.apache.hadoop.yarn.server.resourcemanager.webapp.TestRMWebServicesCapacitySched
Running org.apache.hadoop.yarn.server.resourcemanager.webapp.TestRMWebServicesNodes
Running org.apache.hadoop.yarn.server.resourcemanager.webapp.TestRMWebServicesReservation
Tests run: 72, Failures: 0, Errors: 0, Skipped: 0, Time elapsed: 242.069 sec - in org.apache.hadoop.yarn.server.resourcemanager.webapp.TestRMWebServicesReservation
Running org.apache.hadoop.yarn.server.resourcemanager.webapp.TestRMWebServices
Tests run: 20, Failures: 0, Errors: 0, Skipped: 0, Time elapsed: 14.622 sec - in org.apache.hadoop.yarn.server.resourcemanager.webapp.TestRMWebServices
Running org.apache.hadoop.yarn.server.resourcemanager.webapp.TestRMWebServicesForCSWithPartitions
Tests run: 4, Failures: 0, Errors: 0, Skipped: 0, Time elapsed: 6.337 sec - in org.apache.hadoop.yarn.server.resourcemanager.webapp.TestRMWebServicesForCSWithPartitions
Running org.apache.hadoop.yarn.server.resourcemanager.webapp.TestRMWebServicesApps
Tests run: 40, Failures: 0, Errors: 0, Skipped: 0, Time elapsed: 23.613 sec - in org.apache.hadoop.yarn.server.resourcemanager.webapp.TestRMWebServicesApps
Running org.apache.hadoop.yarn.server.resourcemanager.webapp.TestRMWebServicesHttpStaticUserPermissions
Tests run: 1, Failures: 0, Errors: 0, Skipped: 0, Time elapsed: 8.491 sec - in org.apache.hadoop.yarn.server.resourcemanager.webapp.TestRMWebServicesHttpStaticUserPermissions
Running org.apache.hadoop.yarn.server.resourcemanager.webapp.TestRMWebServicesAppsModification
Tests run: 44, Failures: 0, Errors: 0, Skipped: 0, Time elapsed: 32.863 sec - in org.apache.hadoop.yarn.server.resourcemanager.webapp.TestRMWebServicesAppsModification
Running org.apache.hadoop.yarn.server.resourcemanager.webapp.TestRMWebServicesDelegationTokenAuthentication
Tests run: 8, Failures: 0, Errors: 0, Skipped: 0, Time elapsed: 10.156 sec - in org.apache.hadoop.yarn.server.resourcemanager.webapp.TestRMWebServicesDelegationTokenAuthentication
Running org.apache.hadoop.yarn.server.resourcemanager.webapp.TestRMWebServicesNodeLabels
Tests run: 1, Failures: 0, Errors: 0, Skipped: 0, Time elapsed: 4.406 sec - in org.apache.hadoop.yarn.server.resourcemanager.webapp.TestRMWebServicesNodeLabels
Running org.apache.hadoop.yarn.server.resourcemanager.webapp.TestRMWebappAuthentication
Tests run: 2, Failures: 0, Errors: 0, Skipped: 0, Time elapsed: 10.155 sec - in org.apache.hadoop.yarn.server.resourcemanager.webapp.TestRMWebappAuthentication
Running org.apache.hadoop.yarn.server.resourcemanager.webapp.dao.TestFairSchedulerQueueInfo
Tests run: 1, Failures: 0, Errors: 0, Skipped: 0, Time elapsed: 1.064 sec - in org.apache.hadoop.yarn.server.resourcemanager.webapp.dao.TestFairSchedulerQueueInfo
Running org.apache.hadoop.yarn.server.resourcemanager.webapp.TestNodesPage
Tests run: 5, Failures: 0, Errors: 0, Skipped: 0, Time elapsed: 4.622 sec - in org.apache.hadoop.yarn.server.resourcemanager.webapp.TestNodesPage
Running org.apache.hadoop.yarn.server.resourcemanager.webapp.TestRMWebAppFairScheduler
Tests run: 2, Failures: 0, Errors: 0, Skipped: 0, Time elapsed: 5.788 sec - in org.apache.hadoop.yarn.server.resourcemanager.webapp.TestRMWebAppFairScheduler
Running org.apache.hadoop.yarn.server.resourcemanager.webapp.TestRMWebServicesFairScheduler
Tests run: 3, Failures: 0, Errors: 0, Skipped: 0, Time elapsed: 5.339 sec - in org.apache.hadoop.yarn.server.resourcemanager.webapp.TestRMWebServicesFairScheduler
Running org.apache.hadoop.yarn.server.resourcemanager.webapp.TestRMWebServicesDelegationTokens
Tests run: 6, Failures: 0, Errors: 0, Skipped: 0, Time elapsed: 44.23 sec - in org.apache.hadoop.yarn.server.resourcemanager.webapp.TestRMWebServicesDelegationTokens
Running org.apache.hadoop.yarn.server.resourcemanager.TestClientRMTokens
Tests run: 6, Failures: 0, Errors: 0, Skipped: 0, Time elapsed: 17.998 sec - in org.apache.hadoop.yarn.server.resourcemanager.TestClientRMTokens
Running org.apache.hadoop.yarn.server.resourcemanager.TestAppManager
Tests run: 15, Failures: 0, Errors: 0, Skipped: 0, Time elapsed: 7.471 sec - in org.apache.hadoop.yarn.server.resourcemanager.TestAppManager
Running org.apache.hadoop.yarn.server.resourcemanager.TestResourceTrackerService
Tests run: 27, Failures: 0, Errors: 0, Skipped: 0, Time elapsed: 8.051 sec - in org.apache.hadoop.yarn.server.resourcemanager.TestResourceTrackerService
Running org.apache.hadoop.yarn.server.resourcemanager.placement.TestUserGroupMappingPlacementRule
Tests run: 1, Failures: 0, Errors: 0, Skipped: 0, Time elapsed: 0.916 sec - in org.apache.hadoop.yarn.server.resourcemanager.placement.TestUserGroupMappingPlacementRule
Running org.apache.hadoop.yarn.server.resourcemanager.rmcontainer.TestRMContainerImpl
Tests run: 5, Failures: 0, Errors: 0, Skipped: 0, Time elapsed: 3.549 sec - in org.apache.hadoop.yarn.server.resourcemanager.rmcontainer.TestRMContainerImpl
Running org.apache.hadoop.yarn.server.resourcemanager.TestApplicationMasterService
Tests run: 8, Failures: 0, Errors: 0, Skipped: 0, Time elapsed: 10.378 sec - in org.apache.hadoop.yarn.server.resourcemanager.TestApplicationMasterService
Running org.apache.hadoop.yarn.server.resourcemanager.TestRMRestart
Tests run: 28, Failures: 0, Errors: 0, Skipped: 0, Time elapsed: 66.877 sec - in org.apache.hadoop.yarn.server.resourcemanager.TestRMRestart
Running org.apache.hadoop.yarn.webapp.TestRMWithCSRFFilter
Tests run: 4, Failures: 0, Errors: 0, Skipped: 0, Time elapsed: 5.881 sec - in org.apache.hadoop.yarn.webapp.TestRMWithCSRFFilter

Results :

Failed tests: 
  TestContainerResourceUsage.testUsageAfterAMRestartWithMultipleContainers:252->amRestartTests:395
Unexcpected MemorySeconds value expected:<-1497304858238> but was:<2114>

Tests run: 1355, Failures: 1, Errors: 0, Skipped: 3

[INFO] ------------------------------------------------------------------------
[INFO] Reactor Summary:
[INFO] 
[INFO] Apache Hadoop YARN ................................ SUCCESS [  4.138 s]
[INFO] Apache Hadoop YARN API ............................ SUCCESS [04:19 min]
[INFO] Apache Hadoop YARN Common ......................... SUCCESS [03:05 min]
[INFO] Apache Hadoop YARN Server ......................... SUCCESS [  0.089 s]
[INFO] Apache Hadoop YARN Server Common .................. SUCCESS [ 49.523 s]
[INFO] Apache Hadoop YARN NodeManager .................... SUCCESS [12:03 min]
[INFO] Apache Hadoop YARN Web Proxy ...................... SUCCESS [ 24.890 s]
[INFO] Apache Hadoop YARN ApplicationHistoryService ...... SUCCESS [03:23 min]
[INFO] Apache Hadoop YARN ResourceManager ................ FAILURE [44:50 min]
[INFO] Apache Hadoop YARN Server Tests ................... SKIPPED
[INFO] Apache Hadoop YARN Client ......................... SKIPPED
[INFO] Apache Hadoop YARN SharedCacheManager ............. SKIPPED
[INFO] Apache Hadoop YARN Timeline Plugin Storage ........ SKIPPED
[INFO] Apache Hadoop YARN Applications ................... SKIPPED
[INFO] Apache Hadoop YARN DistributedShell ............... SKIPPED
[INFO] Apache Hadoop YARN Unmanaged Am Launcher .......... SKIPPED
[INFO] Apache Hadoop YARN Site ........................... SKIPPED
[INFO] Apache Hadoop YARN Registry ....................... SKIPPED
[INFO] Apache Hadoop YARN Project ........................ SKIPPED
[INFO] ------------------------------------------------------------------------
[INFO] BUILD FAILURE
[INFO] ------------------------------------------------------------------------
[INFO] Total time: 01:09 h
[INFO] Finished at: 2016-05-02T18:39:50+00:00
[INFO] Final Memory: 63M/460M
[INFO] ------------------------------------------------------------------------
[ERROR] Failed to execute goal org.apache.maven.plugins:maven-surefire-plugin:2.17:test (default-test)
on project hadoop-yarn-server-resourcemanager: There was a timeout or other error in the fork
-> [Help 1]
[ERROR] 
[ERROR] To see the full stack trace of the errors, re-run Maven with the -e switch.
[ERROR] Re-run Maven using the -X switch to enable full debug logging.
[ERROR] 
[ERROR] For more information about the errors and possible solutions, please read the following
articles:
[ERROR] [Help 1] http://cwiki.apache.org/confluence/display/MAVEN/MojoFailureException
[ERROR] 
[ERROR] After correcting the problems, you can resume the build with the command
[ERROR]   mvn <goals> -rf :hadoop-yarn-server-resourcemanager
Build step 'Execute shell' marked build as failure
Archiving artifacts
Recording test results

---------------------------------------------------------------------
To unsubscribe, e-mail: yarn-dev-unsubscribe@hadoop.apache.org
For additional commands, e-mail: yarn-dev-help@hadoop.apache.org


Mime
View raw message