hadoop-yarn-dev mailing list archives

Site index · List index
Message view « Date » · « Thread »
Top « Date » · « Thread »
From Apache Jenkins Server <jenk...@builds.apache.org>
Subject Build failed in Jenkins: Hadoop-Yarn-trunk #2142
Date Fri, 13 May 2016 10:22:31 GMT
See <https://builds.apache.org/job/Hadoop-Yarn-trunk/2142/changes>

Changes:

[stevel] HADOOP-13113 Enable parallel test execution for hadoop-aws. Chris

------------------------------------------
[...truncated 8703 lines...]
[INFO] 
[INFO] --- maven-source-plugin:2.3:jar-no-fork (hadoop-java-sources) @ hadoop-yarn-server-web-proxy
---
[INFO] Building jar: <https://builds.apache.org/job/Hadoop-Yarn-trunk/ws/hadoop-yarn-project/hadoop-yarn/hadoop-yarn-server/hadoop-yarn-server-web-proxy/target/hadoop-yarn-server-web-proxy-3.0.0-alpha1-SNAPSHOT-sources.jar>
[INFO] 
[INFO] --- maven-source-plugin:2.3:test-jar-no-fork (hadoop-java-sources) @ hadoop-yarn-server-web-proxy
---
[INFO] Building jar: <https://builds.apache.org/job/Hadoop-Yarn-trunk/ws/hadoop-yarn-project/hadoop-yarn/hadoop-yarn-server/hadoop-yarn-server-web-proxy/target/hadoop-yarn-server-web-proxy-3.0.0-alpha1-SNAPSHOT-test-sources.jar>
[INFO] 
[INFO] --- maven-enforcer-plugin:1.3.1:enforce (dist-enforce) @ hadoop-yarn-server-web-proxy
---
[INFO] 
[INFO] --- maven-site-plugin:3.5:attach-descriptor (attach-descriptor) @ hadoop-yarn-server-web-proxy
---
[INFO] 
[INFO] --- maven-javadoc-plugin:2.8.1:jar (module-javadocs) @ hadoop-yarn-server-web-proxy
---
[INFO] 
Loading source files for package org.apache.hadoop.yarn.server.webproxy...
Loading source files for package org.apache.hadoop.yarn.server.webproxy.amfilter...
Constructing Javadoc information...
Standard Doclet version 1.7.0_55
Building tree for all the packages and classes...
Generating <https://builds.apache.org/job/Hadoop-Yarn-trunk/ws/hadoop-yarn-project/hadoop-yarn/hadoop-yarn-server/hadoop-yarn-server-web-proxy/target/org/apache/hadoop/yarn/server/webproxy/AppReportFetcher.html...>
Generating <https://builds.apache.org/job/Hadoop-Yarn-trunk/ws/hadoop-yarn-project/hadoop-yarn/hadoop-yarn-server/hadoop-yarn-server-web-proxy/target/org/apache/hadoop/yarn/server/webproxy/ProxyUriUtils.html...>
Generating <https://builds.apache.org/job/Hadoop-Yarn-trunk/ws/hadoop-yarn-project/hadoop-yarn/hadoop-yarn-server/hadoop-yarn-server-web-proxy/target/org/apache/hadoop/yarn/server/webproxy/ProxyUtils.html...>
Generating <https://builds.apache.org/job/Hadoop-Yarn-trunk/ws/hadoop-yarn-project/hadoop-yarn/hadoop-yarn-server/hadoop-yarn-server-web-proxy/target/org/apache/hadoop/yarn/server/webproxy/ProxyUtils._.html...>
Generating <https://builds.apache.org/job/Hadoop-Yarn-trunk/ws/hadoop-yarn-project/hadoop-yarn/hadoop-yarn-server/hadoop-yarn-server-web-proxy/target/org/apache/hadoop/yarn/server/webproxy/ProxyUtils.Page.html...>
Generating <https://builds.apache.org/job/Hadoop-Yarn-trunk/ws/hadoop-yarn-project/hadoop-yarn/hadoop-yarn-server/hadoop-yarn-server-web-proxy/target/org/apache/hadoop/yarn/server/webproxy/WebAppProxy.html...>
Generating <https://builds.apache.org/job/Hadoop-Yarn-trunk/ws/hadoop-yarn-project/hadoop-yarn/hadoop-yarn-server/hadoop-yarn-server-web-proxy/target/org/apache/hadoop/yarn/server/webproxy/WebAppProxyServer.html...>
Generating <https://builds.apache.org/job/Hadoop-Yarn-trunk/ws/hadoop-yarn-project/hadoop-yarn/hadoop-yarn-server/hadoop-yarn-server-web-proxy/target/org/apache/hadoop/yarn/server/webproxy/WebAppProxyServlet.html...>
Generating <https://builds.apache.org/job/Hadoop-Yarn-trunk/ws/hadoop-yarn-project/hadoop-yarn/hadoop-yarn-server/hadoop-yarn-server-web-proxy/target/org/apache/hadoop/yarn/server/webproxy/amfilter/AmFilterInitializer.html...>
Generating <https://builds.apache.org/job/Hadoop-Yarn-trunk/ws/hadoop-yarn-project/hadoop-yarn/hadoop-yarn-server/hadoop-yarn-server-web-proxy/target/org/apache/hadoop/yarn/server/webproxy/amfilter/AmIpFilter.html...>
Generating <https://builds.apache.org/job/Hadoop-Yarn-trunk/ws/hadoop-yarn-project/hadoop-yarn/hadoop-yarn-server/hadoop-yarn-server-web-proxy/target/org/apache/hadoop/yarn/server/webproxy/amfilter/AmIpPrincipal.html...>
Generating <https://builds.apache.org/job/Hadoop-Yarn-trunk/ws/hadoop-yarn-project/hadoop-yarn/hadoop-yarn-server/hadoop-yarn-server-web-proxy/target/org/apache/hadoop/yarn/server/webproxy/amfilter/AmIpServletRequestWrapper.html...>
Generating <https://builds.apache.org/job/Hadoop-Yarn-trunk/ws/hadoop-yarn-project/hadoop-yarn/hadoop-yarn-server/hadoop-yarn-server-web-proxy/target/overview-frame.html...>
Generating <https://builds.apache.org/job/Hadoop-Yarn-trunk/ws/hadoop-yarn-project/hadoop-yarn/hadoop-yarn-server/hadoop-yarn-server-web-proxy/target/org/apache/hadoop/yarn/server/webproxy/package-frame.html...>
Generating <https://builds.apache.org/job/Hadoop-Yarn-trunk/ws/hadoop-yarn-project/hadoop-yarn/hadoop-yarn-server/hadoop-yarn-server-web-proxy/target/org/apache/hadoop/yarn/server/webproxy/package-summary.html...>
Generating <https://builds.apache.org/job/Hadoop-Yarn-trunk/ws/hadoop-yarn-project/hadoop-yarn/hadoop-yarn-server/hadoop-yarn-server-web-proxy/target/org/apache/hadoop/yarn/server/webproxy/package-tree.html...>
Generating <https://builds.apache.org/job/Hadoop-Yarn-trunk/ws/hadoop-yarn-project/hadoop-yarn/hadoop-yarn-server/hadoop-yarn-server-web-proxy/target/org/apache/hadoop/yarn/server/webproxy/amfilter/package-frame.html...>
Generating <https://builds.apache.org/job/Hadoop-Yarn-trunk/ws/hadoop-yarn-project/hadoop-yarn/hadoop-yarn-server/hadoop-yarn-server-web-proxy/target/org/apache/hadoop/yarn/server/webproxy/amfilter/package-summary.html...>
Generating <https://builds.apache.org/job/Hadoop-Yarn-trunk/ws/hadoop-yarn-project/hadoop-yarn/hadoop-yarn-server/hadoop-yarn-server-web-proxy/target/org/apache/hadoop/yarn/server/webproxy/amfilter/package-tree.html...>
Generating <https://builds.apache.org/job/Hadoop-Yarn-trunk/ws/hadoop-yarn-project/hadoop-yarn/hadoop-yarn-server/hadoop-yarn-server-web-proxy/target/constant-values.html...>
Generating <https://builds.apache.org/job/Hadoop-Yarn-trunk/ws/hadoop-yarn-project/hadoop-yarn/hadoop-yarn-server/hadoop-yarn-server-web-proxy/target/serialized-form.html...>
Generating <https://builds.apache.org/job/Hadoop-Yarn-trunk/ws/hadoop-yarn-project/hadoop-yarn/hadoop-yarn-server/hadoop-yarn-server-web-proxy/target/org/apache/hadoop/yarn/server/webproxy/class-use/ProxyUtils.html...>
Generating <https://builds.apache.org/job/Hadoop-Yarn-trunk/ws/hadoop-yarn-project/hadoop-yarn/hadoop-yarn-server/hadoop-yarn-server-web-proxy/target/org/apache/hadoop/yarn/server/webproxy/class-use/ProxyUtils._.html...>
Generating <https://builds.apache.org/job/Hadoop-Yarn-trunk/ws/hadoop-yarn-project/hadoop-yarn/hadoop-yarn-server/hadoop-yarn-server-web-proxy/target/org/apache/hadoop/yarn/server/webproxy/class-use/ProxyUtils.Page.html...>
Generating <https://builds.apache.org/job/Hadoop-Yarn-trunk/ws/hadoop-yarn-project/hadoop-yarn/hadoop-yarn-server/hadoop-yarn-server-web-proxy/target/org/apache/hadoop/yarn/server/webproxy/class-use/ProxyUriUtils.html...>
Generating <https://builds.apache.org/job/Hadoop-Yarn-trunk/ws/hadoop-yarn-project/hadoop-yarn/hadoop-yarn-server/hadoop-yarn-server-web-proxy/target/org/apache/hadoop/yarn/server/webproxy/class-use/WebAppProxyServer.html...>
Generating <https://builds.apache.org/job/Hadoop-Yarn-trunk/ws/hadoop-yarn-project/hadoop-yarn/hadoop-yarn-server/hadoop-yarn-server-web-proxy/target/org/apache/hadoop/yarn/server/webproxy/class-use/AppReportFetcher.html...>
Generating <https://builds.apache.org/job/Hadoop-Yarn-trunk/ws/hadoop-yarn-project/hadoop-yarn/hadoop-yarn-server/hadoop-yarn-server-web-proxy/target/org/apache/hadoop/yarn/server/webproxy/class-use/WebAppProxyServlet.html...>
Generating <https://builds.apache.org/job/Hadoop-Yarn-trunk/ws/hadoop-yarn-project/hadoop-yarn/hadoop-yarn-server/hadoop-yarn-server-web-proxy/target/org/apache/hadoop/yarn/server/webproxy/class-use/WebAppProxy.html...>
Generating <https://builds.apache.org/job/Hadoop-Yarn-trunk/ws/hadoop-yarn-project/hadoop-yarn/hadoop-yarn-server/hadoop-yarn-server-web-proxy/target/org/apache/hadoop/yarn/server/webproxy/amfilter/class-use/AmIpServletRequestWrapper.html...>
Generating <https://builds.apache.org/job/Hadoop-Yarn-trunk/ws/hadoop-yarn-project/hadoop-yarn/hadoop-yarn-server/hadoop-yarn-server-web-proxy/target/org/apache/hadoop/yarn/server/webproxy/amfilter/class-use/AmFilterInitializer.html...>
Generating <https://builds.apache.org/job/Hadoop-Yarn-trunk/ws/hadoop-yarn-project/hadoop-yarn/hadoop-yarn-server/hadoop-yarn-server-web-proxy/target/org/apache/hadoop/yarn/server/webproxy/amfilter/class-use/AmIpPrincipal.html...>
Generating <https://builds.apache.org/job/Hadoop-Yarn-trunk/ws/hadoop-yarn-project/hadoop-yarn/hadoop-yarn-server/hadoop-yarn-server-web-proxy/target/org/apache/hadoop/yarn/server/webproxy/amfilter/class-use/AmIpFilter.html...>
Generating <https://builds.apache.org/job/Hadoop-Yarn-trunk/ws/hadoop-yarn-project/hadoop-yarn/hadoop-yarn-server/hadoop-yarn-server-web-proxy/target/org/apache/hadoop/yarn/server/webproxy/package-use.html...>
Generating <https://builds.apache.org/job/Hadoop-Yarn-trunk/ws/hadoop-yarn-project/hadoop-yarn/hadoop-yarn-server/hadoop-yarn-server-web-proxy/target/org/apache/hadoop/yarn/server/webproxy/amfilter/package-use.html...>
Building index for all the packages and classes...
Generating <https://builds.apache.org/job/Hadoop-Yarn-trunk/ws/hadoop-yarn-project/hadoop-yarn/hadoop-yarn-server/hadoop-yarn-server-web-proxy/target/overview-tree.html...>
Generating <https://builds.apache.org/job/Hadoop-Yarn-trunk/ws/hadoop-yarn-project/hadoop-yarn/hadoop-yarn-server/hadoop-yarn-server-web-proxy/target/index-all.html...>
Generating <https://builds.apache.org/job/Hadoop-Yarn-trunk/ws/hadoop-yarn-project/hadoop-yarn/hadoop-yarn-server/hadoop-yarn-server-web-proxy/target/deprecated-list.html...>
Building index for all classes...
Generating <https://builds.apache.org/job/Hadoop-Yarn-trunk/ws/hadoop-yarn-project/hadoop-yarn/hadoop-yarn-server/hadoop-yarn-server-web-proxy/target/allclasses-frame.html...>
Generating <https://builds.apache.org/job/Hadoop-Yarn-trunk/ws/hadoop-yarn-project/hadoop-yarn/hadoop-yarn-server/hadoop-yarn-server-web-proxy/target/allclasses-noframe.html...>
Generating <https://builds.apache.org/job/Hadoop-Yarn-trunk/ws/hadoop-yarn-project/hadoop-yarn/hadoop-yarn-server/hadoop-yarn-server-web-proxy/target/index.html...>
Generating <https://builds.apache.org/job/Hadoop-Yarn-trunk/ws/hadoop-yarn-project/hadoop-yarn/hadoop-yarn-server/hadoop-yarn-server-web-proxy/target/overview-summary.html...>
Generating <https://builds.apache.org/job/Hadoop-Yarn-trunk/ws/hadoop-yarn-project/hadoop-yarn/hadoop-yarn-server/hadoop-yarn-server-web-proxy/target/help-doc.html...>
[INFO] Building jar: <https://builds.apache.org/job/Hadoop-Yarn-trunk/ws/hadoop-yarn-project/hadoop-yarn/hadoop-yarn-server/hadoop-yarn-server-web-proxy/target/hadoop-yarn-server-web-proxy-3.0.0-alpha1-SNAPSHOT-javadoc.jar>
[INFO] 
[INFO] --- maven-enforcer-plugin:1.3.1:enforce (depcheck) @ hadoop-yarn-server-web-proxy ---
[INFO] 
[INFO] --- maven-checkstyle-plugin:2.15:checkstyle (default-cli) @ hadoop-yarn-server-web-proxy
---
[INFO] There are 161 errors reported by Checkstyle 6.6 with checkstyle/checkstyle.xml ruleset.
[WARNING] Unable to locate Source XRef to link to - DISABLED
[INFO] 
[INFO] --- findbugs-maven-plugin:3.0.0:findbugs (default-cli) @ hadoop-yarn-server-web-proxy
---
[INFO] Fork Value is true
[INFO] Done FindBugs Analysis....
[INFO]                                                                         
[INFO] ------------------------------------------------------------------------
[INFO] Building Apache Hadoop YARN ApplicationHistoryService 3.0.0-alpha1-SNAPSHOT
[INFO] ------------------------------------------------------------------------
[INFO] 
[INFO] --- maven-clean-plugin:2.5:clean (default-clean) @ hadoop-yarn-server-applicationhistoryservice
---
[INFO] Deleting <https://builds.apache.org/job/Hadoop-Yarn-trunk/ws/hadoop-yarn-project/hadoop-yarn/hadoop-yarn-server/hadoop-yarn-server-applicationhistoryservice/target>
[INFO] 
[INFO] --- maven-antrun-plugin:1.7:run (create-testdirs) @ hadoop-yarn-server-applicationhistoryservice
---
[INFO] Executing tasks

main:
    [mkdir] Created dir: <https://builds.apache.org/job/Hadoop-Yarn-trunk/ws/hadoop-yarn-project/hadoop-yarn/hadoop-yarn-server/hadoop-yarn-server-applicationhistoryservice/target/test-dir>
[INFO] Executed tasks
[INFO] 
[INFO] --- hadoop-maven-plugins:3.0.0-alpha1-SNAPSHOT:protoc (compile-protoc) @ hadoop-yarn-server-applicationhistoryservice
---
[INFO] Wrote protoc checksums to file <https://builds.apache.org/job/Hadoop-Yarn-trunk/ws/hadoop-yarn-project/hadoop-yarn/hadoop-yarn-server/hadoop-yarn-server-applicationhistoryservice/target/hadoop-maven-plugins-protoc-checksums.json>
[INFO] 
[INFO] --- maven-resources-plugin:2.6:resources (default-resources) @ hadoop-yarn-server-applicationhistoryservice
---
[INFO] Using 'UTF-8' encoding to copy filtered resources.
[INFO] skip non existing resourceDirectory <https://builds.apache.org/job/Hadoop-Yarn-trunk/ws/hadoop-yarn-project/hadoop-yarn/hadoop-yarn-server/hadoop-yarn-server-applicationhistoryservice/src/main/resources>
[INFO] 
[INFO] --- maven-compiler-plugin:3.1:compile (default-compile) @ hadoop-yarn-server-applicationhistoryservice
---
[INFO] Compiling 67 source files to <https://builds.apache.org/job/Hadoop-Yarn-trunk/ws/hadoop-yarn-project/hadoop-yarn/hadoop-yarn-server/hadoop-yarn-server-applicationhistoryservice/target/classes>
[INFO] 
[INFO] --- maven-resources-plugin:2.6:testResources (default-testResources) @ hadoop-yarn-server-applicationhistoryservice
---
[INFO] Using 'UTF-8' encoding to copy filtered resources.
[INFO] skip non existing resourceDirectory <https://builds.apache.org/job/Hadoop-Yarn-trunk/ws/hadoop-yarn-project/hadoop-yarn/hadoop-yarn-server/hadoop-yarn-server-applicationhistoryservice/src/test/resources>
[INFO] 
[INFO] --- maven-compiler-plugin:3.1:testCompile (default-testCompile) @ hadoop-yarn-server-applicationhistoryservice
---
[INFO] Compiling 22 source files to <https://builds.apache.org/job/Hadoop-Yarn-trunk/ws/hadoop-yarn-project/hadoop-yarn/hadoop-yarn-server/hadoop-yarn-server-applicationhistoryservice/target/test-classes>
[INFO] 
[INFO] --- maven-jar-plugin:2.5:test-jar (default) @ hadoop-yarn-server-applicationhistoryservice
---
[INFO] Building jar: <https://builds.apache.org/job/Hadoop-Yarn-trunk/ws/hadoop-yarn-project/hadoop-yarn/hadoop-yarn-server/hadoop-yarn-server-applicationhistoryservice/target/hadoop-yarn-server-applicationhistoryservice-3.0.0-alpha1-SNAPSHOT-tests.jar>
[INFO] 
[INFO] --- maven-surefire-plugin:2.17:test (default-test) @ hadoop-yarn-server-applicationhistoryservice
---
[INFO] Surefire report directory: <https://builds.apache.org/job/Hadoop-Yarn-trunk/ws/hadoop-yarn-project/hadoop-yarn/hadoop-yarn-server/hadoop-yarn-server-applicationhistoryservice/target/surefire-reports>

-------------------------------------------------------
 T E S T S
-------------------------------------------------------

-------------------------------------------------------
 T E S T S
-------------------------------------------------------
Running org.apache.hadoop.yarn.server.applicationhistoryservice.webapp.TestAHSWebApp
Tests run: 9, Failures: 0, Errors: 0, Skipped: 0, Time elapsed: 6.473 sec - in org.apache.hadoop.yarn.server.applicationhistoryservice.webapp.TestAHSWebApp
Running org.apache.hadoop.yarn.server.applicationhistoryservice.webapp.TestAHSWebServices
Tests run: 30, Failures: 0, Errors: 0, Skipped: 0, Time elapsed: 11.672 sec - in org.apache.hadoop.yarn.server.applicationhistoryservice.webapp.TestAHSWebServices
Running org.apache.hadoop.yarn.server.applicationhistoryservice.TestMemoryApplicationHistoryStore
Tests run: 4, Failures: 0, Errors: 0, Skipped: 0, Time elapsed: 1.68 sec - in org.apache.hadoop.yarn.server.applicationhistoryservice.TestMemoryApplicationHistoryStore
Running org.apache.hadoop.yarn.server.applicationhistoryservice.TestApplicationHistoryClientService
Tests run: 9, Failures: 0, Errors: 0, Skipped: 0, Time elapsed: 1.247 sec - in org.apache.hadoop.yarn.server.applicationhistoryservice.TestApplicationHistoryClientService
Running org.apache.hadoop.yarn.server.applicationhistoryservice.TestFileSystemApplicationHistoryStore
Tests run: 8, Failures: 1, Errors: 2, Skipped: 0, Time elapsed: 18.907 sec <<< FAILURE!
- in org.apache.hadoop.yarn.server.applicationhistoryservice.TestFileSystemApplicationHistoryStore
testMissingApplicationAttemptHistoryData(org.apache.hadoop.yarn.server.applicationhistoryservice.TestFileSystemApplicationHistoryStore)
 Time elapsed: 0.058 sec  <<< ERROR!
java.lang.NullPointerException: null
	at java.util.TreeMap.getEntry(TreeMap.java:342)
	at java.util.TreeMap.get(TreeMap.java:273)
	at org.apache.hadoop.fs.GlobalStorageStatistics.put(GlobalStorageStatistics.java:73)
	at org.apache.hadoop.fs.FileSystem.getStatistics(FileSystem.java:3598)
	at org.apache.hadoop.fs.FileSystem.initialize(FileSystem.java:214)
	at org.apache.hadoop.fs.RawLocalFileSystem.initialize(RawLocalFileSystem.java:101)
	at org.apache.hadoop.yarn.server.applicationhistoryservice.TestFileSystemApplicationHistoryStore.initAndStartStore(TestFileSystemApplicationHistoryStore.java:70)
	at org.apache.hadoop.yarn.server.applicationhistoryservice.TestFileSystemApplicationHistoryStore.setup(TestFileSystemApplicationHistoryStore.java:64)

testMissingApplicationAttemptHistoryData(org.apache.hadoop.yarn.server.applicationhistoryservice.TestFileSystemApplicationHistoryStore)
 Time elapsed: 0.058 sec  <<< ERROR!
java.lang.NullPointerException: null
	at org.apache.hadoop.yarn.server.applicationhistoryservice.TestFileSystemApplicationHistoryStore.tearDown(TestFileSystemApplicationHistoryStore.java:89)

testInitNonExistingWorkingDirectoryInSafeMode(org.apache.hadoop.yarn.server.applicationhistoryservice.TestFileSystemApplicationHistoryStore)
 Time elapsed: 0.526 sec  <<< FAILURE!
org.mockito.exceptions.verification.WantedButNotInvoked: 
Wanted but not invoked:
rawLocalFileSystem.isDirectory(<any>);
-> at org.apache.hadoop.yarn.server.applicationhistoryservice.TestFileSystemApplicationHistoryStore.testInitNonExistingWorkingDirectoryInSafeMode(TestFileSystemApplicationHistoryStore.java:304)

However, there were other interactions with this mock:
-> at org.apache.hadoop.yarn.server.applicationhistoryservice.TestFileSystemApplicationHistoryStore.initAndStartStore(TestFileSystemApplicationHistoryStore.java:70)

	at org.apache.hadoop.yarn.server.applicationhistoryservice.TestFileSystemApplicationHistoryStore.testInitNonExistingWorkingDirectoryInSafeMode(TestFileSystemApplicationHistoryStore.java:304)

Running org.apache.hadoop.yarn.server.applicationhistoryservice.TestApplicationHistoryManagerOnTimelineStore
Tests run: 40, Failures: 0, Errors: 0, Skipped: 0, Time elapsed: 2.214 sec - in org.apache.hadoop.yarn.server.applicationhistoryservice.TestApplicationHistoryManagerOnTimelineStore
Running org.apache.hadoop.yarn.server.applicationhistoryservice.TestApplicationHistoryServer
Tests run: 5, Failures: 0, Errors: 0, Skipped: 0, Time elapsed: 7.709 sec - in org.apache.hadoop.yarn.server.applicationhistoryservice.TestApplicationHistoryServer
Running org.apache.hadoop.yarn.server.applicationhistoryservice.TestApplicationHistoryManagerImpl
Tests run: 1, Failures: 0, Errors: 0, Skipped: 0, Time elapsed: 0.745 sec - in org.apache.hadoop.yarn.server.applicationhistoryservice.TestApplicationHistoryManagerImpl
Running org.apache.hadoop.yarn.server.timeline.webapp.TestTimelineWebServicesWithSSL
Tests run: 1, Failures: 0, Errors: 0, Skipped: 0, Time elapsed: 4.877 sec - in org.apache.hadoop.yarn.server.timeline.webapp.TestTimelineWebServicesWithSSL
Running org.apache.hadoop.yarn.server.timeline.webapp.TestTimelineWebServices
Tests run: 28, Failures: 0, Errors: 0, Skipped: 0, Time elapsed: 39.77 sec - in org.apache.hadoop.yarn.server.timeline.webapp.TestTimelineWebServices
Running org.apache.hadoop.yarn.server.timeline.recovery.TestLeveldbTimelineStateStore
Tests run: 2, Failures: 0, Errors: 0, Skipped: 0, Time elapsed: 1.274 sec - in org.apache.hadoop.yarn.server.timeline.recovery.TestLeveldbTimelineStateStore
Running org.apache.hadoop.yarn.server.timeline.TestTimelineDataManager
Tests run: 4, Failures: 0, Errors: 0, Skipped: 0, Time elapsed: 5.776 sec - in org.apache.hadoop.yarn.server.timeline.TestTimelineDataManager
Running org.apache.hadoop.yarn.server.timeline.TestGenericObjectMapper
Tests run: 2, Failures: 0, Errors: 0, Skipped: 0, Time elapsed: 0.478 sec - in org.apache.hadoop.yarn.server.timeline.TestGenericObjectMapper
Running org.apache.hadoop.yarn.server.timeline.TestRollingLevelDB
Tests run: 2, Failures: 0, Errors: 0, Skipped: 0, Time elapsed: 1.342 sec - in org.apache.hadoop.yarn.server.timeline.TestRollingLevelDB
Running org.apache.hadoop.yarn.server.timeline.TestLeveldbTimelineStore
Tests run: 19, Failures: 0, Errors: 0, Skipped: 0, Time elapsed: 21.97 sec - in org.apache.hadoop.yarn.server.timeline.TestLeveldbTimelineStore
Running org.apache.hadoop.yarn.server.timeline.security.TestTimelineACLsManager
Tests run: 6, Failures: 0, Errors: 0, Skipped: 0, Time elapsed: 1.191 sec - in org.apache.hadoop.yarn.server.timeline.security.TestTimelineACLsManager
Running org.apache.hadoop.yarn.server.timeline.security.TestTimelineAuthenticationFilter
Tests run: 6, Failures: 0, Errors: 0, Skipped: 0, Time elapsed: 11.569 sec - in org.apache.hadoop.yarn.server.timeline.security.TestTimelineAuthenticationFilter
Running org.apache.hadoop.yarn.server.timeline.security.TestTimelineAuthenticationFilterInitializer
Tests run: 1, Failures: 0, Errors: 0, Skipped: 0, Time elapsed: 0.82 sec - in org.apache.hadoop.yarn.server.timeline.security.TestTimelineAuthenticationFilterInitializer
Running org.apache.hadoop.yarn.server.timeline.TestRollingLevelDBTimelineStore
Tests run: 16, Failures: 0, Errors: 0, Skipped: 0, Time elapsed: 19.299 sec - in org.apache.hadoop.yarn.server.timeline.TestRollingLevelDBTimelineStore
Running org.apache.hadoop.yarn.server.timeline.TestMemoryTimelineStore
Tests run: 9, Failures: 0, Errors: 0, Skipped: 0, Time elapsed: 9.305 sec - in org.apache.hadoop.yarn.server.timeline.TestMemoryTimelineStore

Results :

Failed tests: 
  TestFileSystemApplicationHistoryStore.testInitNonExistingWorkingDirectoryInSafeMode:304

Wanted but not invoked:
rawLocalFileSystem.isDirectory(<any>);
-> at org.apache.hadoop.yarn.server.applicationhistoryservice.TestFileSystemApplicationHistoryStore.testInitNonExistingWorkingDirectoryInSafeMode(TestFileSystemApplicationHistoryStore.java:304)

However, there were other interactions with this mock:
-> at org.apache.hadoop.yarn.server.applicationhistoryservice.TestFileSystemApplicationHistoryStore.initAndStartStore(TestFileSystemApplicationHistoryStore.java:70)


Tests in error: 
  TestFileSystemApplicationHistoryStore.setup:64->initAndStartStore:70 ยป NullPointer
  TestFileSystemApplicationHistoryStore.tearDown:89 NullPointer

Tests run: 202, Failures: 1, Errors: 2, Skipped: 0

[INFO] ------------------------------------------------------------------------
[INFO] Reactor Summary:
[INFO] 
[INFO] Apache Hadoop YARN ................................ SUCCESS [  3.774 s]
[INFO] Apache Hadoop YARN API ............................ SUCCESS [04:28 min]
[INFO] Apache Hadoop YARN Common ......................... SUCCESS [03:15 min]
[INFO] Apache Hadoop YARN Server ......................... SUCCESS [  0.096 s]
[INFO] Apache Hadoop YARN Server Common .................. SUCCESS [ 49.555 s]
[INFO] Apache Hadoop YARN NodeManager .................... SUCCESS [12:03 min]
[INFO] Apache Hadoop YARN Web Proxy ...................... SUCCESS [ 25.829 s]
[INFO] Apache Hadoop YARN ApplicationHistoryService ...... FAILURE [02:55 min]
[INFO] Apache Hadoop YARN ResourceManager ................ SKIPPED
[INFO] Apache Hadoop YARN Server Tests ................... SKIPPED
[INFO] Apache Hadoop YARN Client ......................... SKIPPED
[INFO] Apache Hadoop YARN SharedCacheManager ............. SKIPPED
[INFO] Apache Hadoop YARN Timeline Plugin Storage ........ SKIPPED
[INFO] Apache Hadoop YARN Applications ................... SKIPPED
[INFO] Apache Hadoop YARN DistributedShell ............... SKIPPED
[INFO] Apache Hadoop YARN Unmanaged Am Launcher .......... SKIPPED
[INFO] Apache Hadoop YARN Site ........................... SKIPPED
[INFO] Apache Hadoop YARN Registry ....................... SKIPPED
[INFO] Apache Hadoop YARN Project ........................ SKIPPED
[INFO] ------------------------------------------------------------------------
[INFO] BUILD FAILURE
[INFO] ------------------------------------------------------------------------
[INFO] Total time: 24:03 min
[INFO] Finished at: 2016-05-13T10:22:42+00:00
[INFO] Final Memory: 86M/793M
[INFO] ------------------------------------------------------------------------
[ERROR] Failed to execute goal org.apache.maven.plugins:maven-surefire-plugin:2.17:test (default-test)
on project hadoop-yarn-server-applicationhistoryservice: There are test failures.
[ERROR] 
[ERROR] Please refer to <https://builds.apache.org/job/Hadoop-Yarn-trunk/ws/hadoop-yarn-project/hadoop-yarn/hadoop-yarn-server/hadoop-yarn-server-applicationhistoryservice/target/surefire-reports>
for the individual test results.
[ERROR] -> [Help 1]
[ERROR] 
[ERROR] To see the full stack trace of the errors, re-run Maven with the -e switch.
[ERROR] Re-run Maven using the -X switch to enable full debug logging.
[ERROR] 
[ERROR] For more information about the errors and possible solutions, please read the following
articles:
[ERROR] [Help 1] http://cwiki.apache.org/confluence/display/MAVEN/MojoFailureException
[ERROR] 
[ERROR] After correcting the problems, you can resume the build with the command
[ERROR]   mvn <goals> -rf :hadoop-yarn-server-applicationhistoryservice
Build step 'Execute shell' marked build as failure
Archiving artifacts
Recording test results

---------------------------------------------------------------------
To unsubscribe, e-mail: yarn-dev-unsubscribe@hadoop.apache.org
For additional commands, e-mail: yarn-dev-help@hadoop.apache.org


Mime
View raw message