hadoop-yarn-dev mailing list archives

Site index · List index
Message view « Date » · « Thread »
Top « Date » · « Thread »
From "Bibin A Chundatt (JIRA)" <j...@apache.org>
Subject [jira] [Created] (YARN-4974) Random test failure:TestRMApplicationHistoryWriter#testRMWritingMassiveHistoryForCapacitySche
Date Wed, 20 Apr 2016 18:39:25 GMT
Bibin A Chundatt created YARN-4974:
--------------------------------------

             Summary: Random test failure:TestRMApplicationHistoryWriter#testRMWritingMassiveHistoryForCapacitySche
                 Key: YARN-4974
                 URL: https://issues.apache.org/jira/browse/YARN-4974
             Project: Hadoop YARN
          Issue Type: Sub-task
            Reporter: Bibin A Chundatt


https://builds.apache.org/job/PreCommit-YARN-Build/11128/artifact/patchprocess/patch-unit-hadoop-yarn-project_hadoop-yarn_hadoop-yarn-server_hadoop-yarn-server-resourcemanager-jdk1.8.0_77.txt

{noformat}
Tests run: 7, Failures: 1, Errors: 0, Skipped: 0, Time elapsed: 196.959 sec <<< FAILURE!
- in org.apache.hadoop.yarn.server.resourcemanager.ahs.TestRMApplicationHistoryWriter
testRMWritingMassiveHistoryForCapacitySche(org.apache.hadoop.yarn.server.resourcemanager.ahs.TestRMApplicationHistoryWriter)
 Time elapsed: 125.174 sec  <<< FAILURE!
java.lang.AssertionError: null
	at org.junit.Assert.fail(Assert.java:86)
	at org.junit.Assert.assertTrue(Assert.java:41)
	at org.junit.Assert.assertTrue(Assert.java:52)
	at org.apache.hadoop.yarn.server.resourcemanager.ahs.TestRMApplicationHistoryWriter.testRMWritingMassiveHistory(TestRMApplicationHistoryWriter.java:441)
	at org.apache.hadoop.yarn.server.resourcemanager.ahs.TestRMApplicationHistoryWriter.testRMWritingMassiveHistoryForCapacitySche(TestRMApplicationHistoryWriter.java:383)

{noformat}



--
This message was sent by Atlassian JIRA
(v6.3.4#6332)

Mime
View raw message