hadoop-yarn-dev mailing list archives

Site index · List index
Message view « Date » · « Thread »
Top « Date » · « Thread »
From Apache Jenkins Server <jenk...@builds.apache.org>
Subject Hadoop-Yarn-trunk - Build # 2049 - Still Failing
Date Thu, 21 Apr 2016 22:55:20 GMT
See https://builds.apache.org/job/Hadoop-Yarn-trunk/2049/

###################################################################################
########################## LAST 60 LINES OF THE CONSOLE ###########################
[...truncated 7824 lines...]
Tests run: 3, Failures: 0, Errors: 0, Skipped: 0, Time elapsed: 13.795 sec - in org.apache.hadoop.yarn.server.nodemanager.TestDefaultContainerExecutor

Results :

Tests in error: 
  TestContainerManagerRecovery.testApplicationRecovery:189->startContainer:511 » IllegalState
  TestContainerManagerRecovery.testContainerCleanupOnShutdown:412->startContainer:511 »
IllegalState
  TestContainerManagerRecovery.testContainerResizeRecovery:351->startContainer:511 » IllegalState

Tests run: 448, Failures: 0, Errors: 3, Skipped: 17

[INFO] ------------------------------------------------------------------------
[INFO] Reactor Summary:
[INFO] 
[INFO] Apache Hadoop YARN ................................ SUCCESS [  5.885 s]
[INFO] Apache Hadoop YARN API ............................ SUCCESS [07:05 min]
[INFO] Apache Hadoop YARN Common ......................... SUCCESS [05:12 min]
[INFO] Apache Hadoop YARN Server ......................... SUCCESS [  0.159 s]
[INFO] Apache Hadoop YARN Server Common .................. SUCCESS [01:23 min]
[INFO] Apache Hadoop YARN NodeManager .................... FAILURE [13:18 min]
[INFO] Apache Hadoop YARN Web Proxy ...................... SKIPPED
[INFO] Apache Hadoop YARN ApplicationHistoryService ...... SKIPPED
[INFO] Apache Hadoop YARN ResourceManager ................ SKIPPED
[INFO] Apache Hadoop YARN Server Tests ................... SKIPPED
[INFO] Apache Hadoop YARN Client ......................... SKIPPED
[INFO] Apache Hadoop YARN SharedCacheManager ............. SKIPPED
[INFO] Apache Hadoop YARN Timeline Plugin Storage ........ SKIPPED
[INFO] Apache Hadoop YARN Applications ................... SKIPPED
[INFO] Apache Hadoop YARN DistributedShell ............... SKIPPED
[INFO] Apache Hadoop YARN Unmanaged Am Launcher .......... SKIPPED
[INFO] Apache Hadoop YARN Site ........................... SKIPPED
[INFO] Apache Hadoop YARN Registry ....................... SKIPPED
[INFO] Apache Hadoop YARN Project ........................ SKIPPED
[INFO] ------------------------------------------------------------------------
[INFO] BUILD FAILURE
[INFO] ------------------------------------------------------------------------
[INFO] Total time: 27:07 min
[INFO] Finished at: 2016-04-21T22:55:18+00:00
[INFO] Final Memory: 76M/918M
[INFO] ------------------------------------------------------------------------
[ERROR] Failed to execute goal org.apache.maven.plugins:maven-surefire-plugin:2.17:test (default-test)
on project hadoop-yarn-server-nodemanager: There are test failures.
[ERROR] 
[ERROR] Please refer to /home/jenkins/jenkins-slave/workspace/Hadoop-Yarn-trunk/hadoop-yarn-project/hadoop-yarn/hadoop-yarn-server/hadoop-yarn-server-nodemanager/target/surefire-reports
for the individual test results.
[ERROR] -> [Help 1]
[ERROR] 
[ERROR] To see the full stack trace of the errors, re-run Maven with the -e switch.
[ERROR] Re-run Maven using the -X switch to enable full debug logging.
[ERROR] 
[ERROR] For more information about the errors and possible solutions, please read the following
articles:
[ERROR] [Help 1] http://cwiki.apache.org/confluence/display/MAVEN/MojoFailureException
[ERROR] 
[ERROR] After correcting the problems, you can resume the build with the command
[ERROR]   mvn <goals> -rf :hadoop-yarn-server-nodemanager
Build step 'Execute shell' marked build as failure
Archiving artifacts
Recording test results
Sending e-mails to: yarn-dev@hadoop.apache.org
Email was triggered for: Failure - Any
Sending email for trigger: Failure - Any



###################################################################################
############################## FAILED TESTS (if any) ##############################
3 tests failed.
FAILED:  org.apache.hadoop.yarn.server.nodemanager.containermanager.TestContainerManagerRecovery.testApplicationRecovery

Error Message:
InputStream#read(byte[]) returned invalid result: 0
The InputStream implementation is buggy.

Stack Trace:
java.lang.IllegalStateException: InputStream#read(byte[]) returned invalid result: 0
The InputStream implementation is buggy.
	at com.google.protobuf.CodedInputStream.refillBuffer(CodedInputStream.java:739)
	at com.google.protobuf.CodedInputStream.isAtEnd(CodedInputStream.java:701)
	at com.google.protobuf.CodedInputStream.readTag(CodedInputStream.java:99)
	at org.apache.hadoop.security.proto.SecurityProtos$CredentialsProto.<init>(SecurityProtos.java:1828)
	at org.apache.hadoop.security.proto.SecurityProtos$CredentialsProto.<init>(SecurityProtos.java:1792)
	at org.apache.hadoop.security.proto.SecurityProtos$CredentialsProto$1.parsePartialFrom(SecurityProtos.java:1892)
	at org.apache.hadoop.security.proto.SecurityProtos$CredentialsProto$1.parsePartialFrom(SecurityProtos.java:1887)
	at com.google.protobuf.AbstractParser.parsePartialFrom(AbstractParser.java:200)
	at com.google.protobuf.AbstractParser.parseFrom(AbstractParser.java:217)
	at com.google.protobuf.AbstractParser.parseFrom(AbstractParser.java:223)
	at com.google.protobuf.AbstractParser.parseFrom(AbstractParser.java:49)
	at org.apache.hadoop.security.proto.SecurityProtos$CredentialsProto.parseFrom(SecurityProtos.java:2100)
	at org.apache.hadoop.security.Credentials.readProtos(Credentials.java:331)
	at org.apache.hadoop.security.Credentials.readTokenStorageStream(Credentials.java:226)
	at org.apache.hadoop.yarn.server.utils.YarnServerSecurityUtils.parseCredentials(YarnServerSecurityUtils.java:131)
	at org.apache.hadoop.yarn.server.nodemanager.containermanager.ContainerManagerImpl.startContainerInternal(ContainerManagerImpl.java:924)
	at org.apache.hadoop.yarn.server.nodemanager.containermanager.ContainerManagerImpl.startContainers(ContainerManagerImpl.java:815)
	at org.apache.hadoop.yarn.server.nodemanager.containermanager.TestContainerManagerRecovery$3.run(TestContainerManagerRecovery.java:514)
	at org.apache.hadoop.yarn.server.nodemanager.containermanager.TestContainerManagerRecovery$3.run(TestContainerManagerRecovery.java:511)
	at java.security.AccessController.doPrivileged(Native Method)
	at javax.security.auth.Subject.doAs(Subject.java:415)
	at org.apache.hadoop.security.UserGroupInformation.doAs(UserGroupInformation.java:1742)
	at org.apache.hadoop.yarn.server.nodemanager.containermanager.TestContainerManagerRecovery.startContainer(TestContainerManagerRecovery.java:511)
	at org.apache.hadoop.yarn.server.nodemanager.containermanager.TestContainerManagerRecovery.testApplicationRecovery(TestContainerManagerRecovery.java:189)


FAILED:  org.apache.hadoop.yarn.server.nodemanager.containermanager.TestContainerManagerRecovery.testContainerCleanupOnShutdown

Error Message:
InputStream#read(byte[]) returned invalid result: 0
The InputStream implementation is buggy.

Stack Trace:
java.lang.IllegalStateException: InputStream#read(byte[]) returned invalid result: 0
The InputStream implementation is buggy.
	at com.google.protobuf.CodedInputStream.refillBuffer(CodedInputStream.java:739)
	at com.google.protobuf.CodedInputStream.isAtEnd(CodedInputStream.java:701)
	at com.google.protobuf.CodedInputStream.readTag(CodedInputStream.java:99)
	at org.apache.hadoop.security.proto.SecurityProtos$CredentialsProto.<init>(SecurityProtos.java:1828)
	at org.apache.hadoop.security.proto.SecurityProtos$CredentialsProto.<init>(SecurityProtos.java:1792)
	at org.apache.hadoop.security.proto.SecurityProtos$CredentialsProto$1.parsePartialFrom(SecurityProtos.java:1892)
	at org.apache.hadoop.security.proto.SecurityProtos$CredentialsProto$1.parsePartialFrom(SecurityProtos.java:1887)
	at com.google.protobuf.AbstractParser.parsePartialFrom(AbstractParser.java:200)
	at com.google.protobuf.AbstractParser.parseFrom(AbstractParser.java:217)
	at com.google.protobuf.AbstractParser.parseFrom(AbstractParser.java:223)
	at com.google.protobuf.AbstractParser.parseFrom(AbstractParser.java:49)
	at org.apache.hadoop.security.proto.SecurityProtos$CredentialsProto.parseFrom(SecurityProtos.java:2100)
	at org.apache.hadoop.security.Credentials.readProtos(Credentials.java:331)
	at org.apache.hadoop.security.Credentials.readTokenStorageStream(Credentials.java:226)
	at org.apache.hadoop.yarn.server.utils.YarnServerSecurityUtils.parseCredentials(YarnServerSecurityUtils.java:131)
	at org.apache.hadoop.yarn.server.nodemanager.containermanager.ContainerManagerImpl.startContainerInternal(ContainerManagerImpl.java:924)
	at org.apache.hadoop.yarn.server.nodemanager.containermanager.TestContainerManagerRecovery$3.run(TestContainerManagerRecovery.java:514)
	at org.apache.hadoop.yarn.server.nodemanager.containermanager.TestContainerManagerRecovery$3.run(TestContainerManagerRecovery.java:511)
	at java.security.AccessController.doPrivileged(Native Method)
	at javax.security.auth.Subject.doAs(Subject.java:415)
	at org.apache.hadoop.security.UserGroupInformation.doAs(UserGroupInformation.java:1742)
	at org.apache.hadoop.yarn.server.nodemanager.containermanager.TestContainerManagerRecovery.startContainer(TestContainerManagerRecovery.java:511)
	at org.apache.hadoop.yarn.server.nodemanager.containermanager.TestContainerManagerRecovery.testContainerCleanupOnShutdown(TestContainerManagerRecovery.java:412)


FAILED:  org.apache.hadoop.yarn.server.nodemanager.containermanager.TestContainerManagerRecovery.testContainerResizeRecovery

Error Message:
InputStream#read(byte[]) returned invalid result: 0
The InputStream implementation is buggy.

Stack Trace:
java.lang.IllegalStateException: InputStream#read(byte[]) returned invalid result: 0
The InputStream implementation is buggy.
	at com.google.protobuf.CodedInputStream.refillBuffer(CodedInputStream.java:739)
	at com.google.protobuf.CodedInputStream.isAtEnd(CodedInputStream.java:701)
	at com.google.protobuf.CodedInputStream.readTag(CodedInputStream.java:99)
	at org.apache.hadoop.security.proto.SecurityProtos$CredentialsProto.<init>(SecurityProtos.java:1828)
	at org.apache.hadoop.security.proto.SecurityProtos$CredentialsProto.<init>(SecurityProtos.java:1792)
	at org.apache.hadoop.security.proto.SecurityProtos$CredentialsProto$1.parsePartialFrom(SecurityProtos.java:1892)
	at org.apache.hadoop.security.proto.SecurityProtos$CredentialsProto$1.parsePartialFrom(SecurityProtos.java:1887)
	at com.google.protobuf.AbstractParser.parsePartialFrom(AbstractParser.java:200)
	at com.google.protobuf.AbstractParser.parseFrom(AbstractParser.java:217)
	at com.google.protobuf.AbstractParser.parseFrom(AbstractParser.java:223)
	at com.google.protobuf.AbstractParser.parseFrom(AbstractParser.java:49)
	at org.apache.hadoop.security.proto.SecurityProtos$CredentialsProto.parseFrom(SecurityProtos.java:2100)
	at org.apache.hadoop.security.Credentials.readProtos(Credentials.java:331)
	at org.apache.hadoop.security.Credentials.readTokenStorageStream(Credentials.java:226)
	at org.apache.hadoop.yarn.server.utils.YarnServerSecurityUtils.parseCredentials(YarnServerSecurityUtils.java:131)
	at org.apache.hadoop.yarn.server.nodemanager.containermanager.ContainerManagerImpl.startContainerInternal(ContainerManagerImpl.java:924)
	at org.apache.hadoop.yarn.server.nodemanager.containermanager.ContainerManagerImpl.startContainers(ContainerManagerImpl.java:815)
	at org.apache.hadoop.yarn.server.nodemanager.containermanager.TestContainerManagerRecovery$3.run(TestContainerManagerRecovery.java:514)
	at org.apache.hadoop.yarn.server.nodemanager.containermanager.TestContainerManagerRecovery$3.run(TestContainerManagerRecovery.java:511)
	at java.security.AccessController.doPrivileged(Native Method)
	at javax.security.auth.Subject.doAs(Subject.java:415)
	at org.apache.hadoop.security.UserGroupInformation.doAs(UserGroupInformation.java:1742)
	at org.apache.hadoop.yarn.server.nodemanager.containermanager.TestContainerManagerRecovery.startContainer(TestContainerManagerRecovery.java:511)
	at org.apache.hadoop.yarn.server.nodemanager.containermanager.TestContainerManagerRecovery.testContainerResizeRecovery(TestContainerManagerRecovery.java:351)



Mime
  • Unnamed multipart/mixed (inline, None, 0 bytes)
View raw message