hadoop-yarn-dev mailing list archives

Site index · List index
Message view « Date » · « Thread »
Top « Date » · « Thread »
From Apache Jenkins Server <jenk...@builds.apache.org>
Subject Build failed in Jenkins: Hadoop-Yarn-trunk #2028
Date Sun, 17 Apr 2016 08:10:41 GMT
See <https://builds.apache.org/job/Hadoop-Yarn-trunk/2028/changes>

Changes:

[wangda] YARN-4934. Reserved Resource for QueueMetrics needs to be handled

------------------------------------------
[...truncated 9396 lines...]
        at java.util.concurrent.locks.AbstractQueuedSynchronizer$ConditionObject.await(AbstractQueuedSynchronizer.java:2043)
        at java.util.concurrent.LinkedBlockingQueue.take(LinkedBlockingQueue.java:442)
        at org.apache.hadoop.yarn.event.AsyncDispatcher$1.run(AsyncDispatcher.java:102)
        at java.lang.Thread.run(Thread.java:745)
"Ping Checker"  prio=5 tid=105 timed_waiting
java.lang.Thread.State: TIMED_WAITING
        at java.lang.Thread.sleep(Native Method)
        at org.apache.hadoop.yarn.util.AbstractLivelinessMonitor$PingChecker.run(AbstractLivelinessMonitor.java:137)
        at java.lang.Thread.run(Thread.java:745)
"org.apache.hadoop.util.JvmPauseMonitor$Monitor@7e37d95" daemon prio=5 tid=27 timed_waiting
java.lang.Thread.State: TIMED_WAITING
        at java.lang.Thread.sleep(Native Method)
        at org.apache.hadoop.util.JvmPauseMonitor$Monitor.run(JvmPauseMonitor.java:192)
        at java.lang.Thread.run(Thread.java:745)
"Timer-15"  prio=5 tid=66 timed_waiting
java.lang.Thread.State: TIMED_WAITING
        at java.lang.Object.wait(Native Method)
        at java.util.TimerThread.mainLoop(Timer.java:552)
        at java.util.TimerThread.run(Timer.java:505)
"Ping Checker"  prio=5 tid=106 timed_waiting
java.lang.Thread.State: TIMED_WAITING
        at java.lang.Thread.sleep(Native Method)
        at org.apache.hadoop.yarn.util.AbstractLivelinessMonitor$PingChecker.run(AbstractLivelinessMonitor.java:137)
        at java.lang.Thread.run(Thread.java:745)
"Reference Handler" daemon prio=10 tid=2 in Object.wait()
java.lang.Thread.State: WAITING (on object monitor)
        at java.lang.Object.wait(Native Method)
        at java.lang.Object.wait(Object.java:503)
        at java.lang.ref.Reference$ReferenceHandler.run(Reference.java:133)
"Timer-21"  prio=5 tid=94 timed_waiting
java.lang.Thread.State: TIMED_WAITING
        at java.lang.Object.wait(Native Method)
        at java.util.TimerThread.mainLoop(Timer.java:552)
        at java.util.TimerThread.run(Timer.java:505)
"Signal Dispatcher" daemon prio=9 tid=4 runnable
java.lang.Thread.State: RUNNABLE
"Ping Checker"  prio=5 tid=25 timed_waiting
java.lang.Thread.State: TIMED_WAITING
        at java.lang.Thread.sleep(Native Method)
        at org.apache.hadoop.yarn.util.AbstractLivelinessMonitor$PingChecker.run(AbstractLivelinessMonitor.java:137)
        at java.lang.Thread.run(Thread.java:745)
"AsyncDispatcher event handler"  prio=5 tid=44 in Object.wait()
java.lang.Thread.State: WAITING (on object monitor)
        at sun.misc.Unsafe.park(Native Method)
        at java.util.concurrent.locks.LockSupport.park(LockSupport.java:186)
        at java.util.concurrent.locks.AbstractQueuedSynchronizer$ConditionObject.await(AbstractQueuedSynchronizer.java:2043)
        at java.util.concurrent.LinkedBlockingQueue.take(LinkedBlockingQueue.java:442)
        at org.apache.hadoop.yarn.event.AsyncDispatcher$1.run(AsyncDispatcher.java:102)
        at java.lang.Thread.run(Thread.java:745)
"Timer-19"  prio=5 tid=82 timed_waiting
java.lang.Thread.State: TIMED_WAITING
        at java.lang.Object.wait(Native Method)
        at java.util.TimerThread.mainLoop(Timer.java:552)
        at java.util.TimerThread.run(Timer.java:505)
"Timer-3"  prio=5 tid=19 timed_waiting
java.lang.Thread.State: TIMED_WAITING
        at java.lang.Object.wait(Native Method)
        at java.util.TimerThread.mainLoop(Timer.java:552)
        at java.util.TimerThread.run(Timer.java:505)
"Ping Checker"  prio=5 tid=39 timed_waiting
java.lang.Thread.State: TIMED_WAITING
        at java.lang.Thread.sleep(Native Method)
        at org.apache.hadoop.yarn.util.AbstractLivelinessMonitor$PingChecker.run(AbstractLivelinessMonitor.java:137)
        at java.lang.Thread.run(Thread.java:745)
"org.apache.hadoop.util.JvmPauseMonitor$Monitor@58be33e" daemon prio=5 tid=43 timed_waiting
java.lang.Thread.State: TIMED_WAITING
        at java.lang.Thread.sleep(Native Method)
        at org.apache.hadoop.util.JvmPauseMonitor$Monitor.run(JvmPauseMonitor.java:192)
        at java.lang.Thread.run(Thread.java:745)
"org.apache.hadoop.util.JvmPauseMonitor$Monitor@7e54be29" daemon prio=5 tid=107 timed_waiting
java.lang.Thread.State: TIMED_WAITING
        at java.lang.Thread.sleep(Native Method)
        at org.apache.hadoop.util.JvmPauseMonitor$Monitor.run(JvmPauseMonitor.java:192)
        at java.lang.Thread.run(Thread.java:745)
"Ping Checker"  prio=5 tid=24 timed_waiting
java.lang.Thread.State: TIMED_WAITING
        at java.lang.Thread.sleep(Native Method)
        at org.apache.hadoop.yarn.util.AbstractLivelinessMonitor$PingChecker.run(AbstractLivelinessMonitor.java:137)
        at java.lang.Thread.run(Thread.java:745)
"Timer-0"  prio=5 tid=13 timed_waiting
java.lang.Thread.State: TIMED_WAITING
        at java.lang.Object.wait(Native Method)
        at java.util.TimerThread.mainLoop(Timer.java:552)
        at java.util.TimerThread.run(Timer.java:505)
"Thread[Thread-26,5,main]" daemon prio=5 tid=38 timed_waiting
java.lang.Thread.State: TIMED_WAITING
        at java.lang.Thread.sleep(Native Method)
        at org.apache.hadoop.security.token.delegation.AbstractDelegationTokenSecretManager$ExpiredTokenRemover.run(AbstractDelegationTokenSecretManager.java:668)
        at java.lang.Thread.run(Thread.java:745)
"Thread[Thread-86,5,main]" daemon prio=5 tid=102 timed_waiting
java.lang.Thread.State: TIMED_WAITING
        at java.lang.Thread.sleep(Native Method)
        at org.apache.hadoop.security.token.delegation.AbstractDelegationTokenSecretManager$ExpiredTokenRemover.run(AbstractDelegationTokenSecretManager.java:668)
        at java.lang.Thread.run(Thread.java:745)
"Ping Checker"  prio=5 tid=40 timed_waiting
java.lang.Thread.State: TIMED_WAITING
        at java.lang.Thread.sleep(Native Method)
        at org.apache.hadoop.yarn.util.AbstractLivelinessMonitor$PingChecker.run(AbstractLivelinessMonitor.java:137)
        at java.lang.Thread.run(Thread.java:745)
"Ping Checker"  prio=5 tid=26 timed_waiting
java.lang.Thread.State: TIMED_WAITING
        at java.lang.Thread.sleep(Native Method)
        at org.apache.hadoop.yarn.util.AbstractLivelinessMonitor$PingChecker.run(AbstractLivelinessMonitor.java:137)
        at java.lang.Thread.run(Thread.java:745)
"Timer-22"  prio=5 tid=95 timed_waiting
java.lang.Thread.State: TIMED_WAITING
        at java.lang.Object.wait(Native Method)
        at java.util.TimerThread.mainLoop(Timer.java:552)
        at java.util.TimerThread.run(Timer.java:505)
"Ping Checker"  prio=5 tid=104 timed_waiting
java.lang.Thread.State: TIMED_WAITING
        at java.lang.Thread.sleep(Native Method)
        at org.apache.hadoop.yarn.util.AbstractLivelinessMonitor$PingChecker.run(AbstractLivelinessMonitor.java:137)
        at java.lang.Thread.run(Thread.java:745)
"Timer-23"  prio=5 tid=99 timed_waiting
java.lang.Thread.State: TIMED_WAITING
        at java.lang.Object.wait(Native Method)
        at java.util.TimerThread.mainLoop(Timer.java:552)
        at java.util.TimerThread.run(Timer.java:505)
"main"  prio=5 tid=1 runnable
java.lang.Thread.State: RUNNABLE
        at java.lang.Thread.dumpThreads(Native Method)
        at java.lang.Thread.getAllStackTraces(Thread.java:1640)
Tests run: 10, Failures: 0, Errors: 1, Skipped: 0, Time elapsed: 204.782 sec <<<
FAILURE! - in org.apache.hadoop.yarn.server.resourcemanager.applicationsmanager.TestAMRestart
testAMRestartNotLostContainerCompleteMsg(org.apache.hadoop.yarn.server.resourcemanager.applicationsmanager.TestAMRestart)
 Time elapsed: 30.022 sec  <<< ERROR!
java.lang.Exception: test timed out after 30000 milliseconds
	at java.lang.Thread.sleep(Native Method)
	at org.apache.hadoop.yarn.server.resourcemanager.MockRM.waitForState(MockRM.java:314)
	at org.apache.hadoop.yarn.server.resourcemanager.MockRM.waitForState(MockRM.java:299)
	at org.apache.hadoop.yarn.server.resourcemanager.MockRM.waitForState(MockRM.java:294)
	at org.apache.hadoop.yarn.server.resourcemanager.applicationsmanager.TestAMRestart.testAMRestartNotLostContainerCompleteMsg(TestAMRestart.java:948)

        at org.apache.hadoop.test.TimedOutTestsListener.buildThrea
Running org.apache.hadoop.yarn.server.resourcemanager.applicationsmanager.TestAMRMRPCNodeUpdates
Tests run: 1, Failures: 0, Errors: 0, Skipped: 0, Time elapsed: 10.946 sec - in org.apache.hadoop.yarn.server.resourcemanager.applicationsmanager.TestAMRMRPCNodeUpdates
Running org.apache.hadoop.yarn.server.resourcemanager.applicationsmanager.TestAMRMRPCResponseId
Tests run: 1, Failures: 0, Errors: 0, Skipped: 0, Time elapsed: 7.807 sec - in org.apache.hadoop.yarn.server.resourcemanager.applicationsmanager.TestAMRMRPCResponseId
Running org.apache.hadoop.yarn.server.resourcemanager.TestRMAdminService
Tests run: 23, Failures: 0, Errors: 0, Skipped: 0, Time elapsed: 35.113 sec - in org.apache.hadoop.yarn.server.resourcemanager.TestRMAdminService
Running org.apache.hadoop.yarn.server.resourcemanager.TestRM
Tests run: 11, Failures: 0, Errors: 0, Skipped: 0, Time elapsed: 98.979 sec - in org.apache.hadoop.yarn.server.resourcemanager.TestRM
Running org.apache.hadoop.yarn.server.resourcemanager.rmapp.TestNodesListManager
Tests run: 4, Failures: 0, Errors: 0, Skipped: 0, Time elapsed: 15.601 sec - in org.apache.hadoop.yarn.server.resourcemanager.rmapp.TestNodesListManager
Running org.apache.hadoop.yarn.server.resourcemanager.rmapp.attempt.TestAMLivelinessMonitor
Tests run: 1, Failures: 0, Errors: 0, Skipped: 0, Time elapsed: 3.672 sec - in org.apache.hadoop.yarn.server.resourcemanager.rmapp.attempt.TestAMLivelinessMonitor
Running org.apache.hadoop.yarn.server.resourcemanager.rmapp.attempt.TestRMAppAttemptTransitions
Tests run: 86, Failures: 0, Errors: 0, Skipped: 1, Time elapsed: 14.45 sec - in org.apache.hadoop.yarn.server.resourcemanager.rmapp.attempt.TestRMAppAttemptTransitions
Running org.apache.hadoop.yarn.server.resourcemanager.rmapp.TestRMAppTransitions
Tests run: 46, Failures: 0, Errors: 0, Skipped: 0, Time elapsed: 7.415 sec - in org.apache.hadoop.yarn.server.resourcemanager.rmapp.TestRMAppTransitions
Running org.apache.hadoop.yarn.server.resourcemanager.TestResourceManager
Tests run: 5, Failures: 0, Errors: 0, Skipped: 0, Time elapsed: 9.027 sec - in org.apache.hadoop.yarn.server.resourcemanager.TestResourceManager
Running org.apache.hadoop.yarn.server.resourcemanager.TestApplicationCleanup
Tests run: 7, Failures: 0, Errors: 0, Skipped: 0, Time elapsed: 45.642 sec - in org.apache.hadoop.yarn.server.resourcemanager.TestApplicationCleanup
Running org.apache.hadoop.yarn.server.resourcemanager.TestApplicationMasterLauncher
Tests run: 4, Failures: 0, Errors: 0, Skipped: 0, Time elapsed: 24.404 sec - in org.apache.hadoop.yarn.server.resourcemanager.TestApplicationMasterLauncher
Running org.apache.hadoop.yarn.server.resourcemanager.TestRMDispatcher
Tests run: 1, Failures: 0, Errors: 0, Skipped: 0, Time elapsed: 2.719 sec - in org.apache.hadoop.yarn.server.resourcemanager.TestRMDispatcher
Running org.apache.hadoop.yarn.server.resourcemanager.TestRMHAForNodeLabels
Tests run: 1, Failures: 0, Errors: 0, Skipped: 0, Time elapsed: 6.588 sec - in org.apache.hadoop.yarn.server.resourcemanager.TestRMHAForNodeLabels
Running org.apache.hadoop.yarn.server.resourcemanager.recovery.TestMemoryRMStateStore
Tests run: 1, Failures: 0, Errors: 0, Skipped: 0, Time elapsed: 1.529 sec - in org.apache.hadoop.yarn.server.resourcemanager.recovery.TestMemoryRMStateStore
Running org.apache.hadoop.yarn.server.resourcemanager.recovery.TestZKRMStateStore
Tests run: 6, Failures: 0, Errors: 0, Skipped: 0, Time elapsed: 34.229 sec - in org.apache.hadoop.yarn.server.resourcemanager.recovery.TestZKRMStateStore
Running org.apache.hadoop.yarn.server.resourcemanager.recovery.TestProtos
Tests run: 1, Failures: 0, Errors: 0, Skipped: 0, Time elapsed: 0.404 sec - in org.apache.hadoop.yarn.server.resourcemanager.recovery.TestProtos
Running org.apache.hadoop.yarn.server.resourcemanager.recovery.TestLeveldbRMStateStore
Tests run: 10, Failures: 0, Errors: 0, Skipped: 0, Time elapsed: 8.639 sec - in org.apache.hadoop.yarn.server.resourcemanager.recovery.TestLeveldbRMStateStore
Running org.apache.hadoop.yarn.server.resourcemanager.recovery.TestFSRMStateStore
Tests run: 4, Failures: 0, Errors: 0, Skipped: 0, Time elapsed: 45.88 sec - in org.apache.hadoop.yarn.server.resourcemanager.recovery.TestFSRMStateStore
Running org.apache.hadoop.yarn.server.resourcemanager.recovery.TestZKRMStateStoreZKClientConnections
Tests run: 4, Failures: 0, Errors: 0, Skipped: 0, Time elapsed: 10.55 sec - in org.apache.hadoop.yarn.server.resourcemanager.recovery.TestZKRMStateStoreZKClientConnections
Running org.apache.hadoop.yarn.server.resourcemanager.recovery.TestZKRMStateStorePerf
Tests run: 1, Failures: 0, Errors: 0, Skipped: 0, Time elapsed: 59.529 sec - in org.apache.hadoop.yarn.server.resourcemanager.recovery.TestZKRMStateStorePerf
Running org.apache.hadoop.yarn.server.resourcemanager.TestRMRestart
Tests run: 28, Failures: 0, Errors: 0, Skipped: 0, Time elapsed: 253.873 sec - in org.apache.hadoop.yarn.server.resourcemanager.TestRMRestart
Running org.apache.hadoop.yarn.server.resourcemanager.TestMoveApplication
Tests run: 4, Failures: 0, Errors: 0, Skipped: 0, Time elapsed: 6.532 sec - in org.apache.hadoop.yarn.server.resourcemanager.TestMoveApplication
Running org.apache.hadoop.yarn.server.resourcemanager.TestRMHA
Tests run: 9, Failures: 0, Errors: 0, Skipped: 0, Time elapsed: 48.284 sec - in org.apache.hadoop.yarn.server.resourcemanager.TestRMHA
Running org.apache.hadoop.yarn.server.resourcemanager.TestRMProxyUsersConf
Tests run: 3, Failures: 0, Errors: 0, Skipped: 0, Time elapsed: 34.4 sec - in org.apache.hadoop.yarn.server.resourcemanager.TestRMProxyUsersConf
Running org.apache.hadoop.yarn.server.resourcemanager.nodelabels.TestRMDelegatedNodeLabelsUpdater
Tests run: 3, Failures: 0, Errors: 0, Skipped: 0, Time elapsed: 16.883 sec - in org.apache.hadoop.yarn.server.resourcemanager.nodelabels.TestRMDelegatedNodeLabelsUpdater
Running org.apache.hadoop.yarn.server.resourcemanager.nodelabels.TestRMNodeLabelsManager
Tests run: 11, Failures: 0, Errors: 0, Skipped: 0, Time elapsed: 5.527 sec - in org.apache.hadoop.yarn.server.resourcemanager.nodelabels.TestRMNodeLabelsManager
Running org.apache.hadoop.yarn.server.resourcemanager.logaggregationstatus.TestRMAppLogAggregationStatus
Tests run: 2, Failures: 0, Errors: 0, Skipped: 0, Time elapsed: 4.64 sec - in org.apache.hadoop.yarn.server.resourcemanager.logaggregationstatus.TestRMAppLogAggregationStatus
Running org.apache.hadoop.yarn.server.resourcemanager.TestApplicationACLs
Tests run: 1, Failures: 0, Errors: 0, Skipped: 0, Time elapsed: 9.922 sec - in org.apache.hadoop.yarn.server.resourcemanager.TestApplicationACLs
Running org.apache.hadoop.yarn.server.resourcemanager.metrics.TestSystemMetricsPublisher
Tests run: 4, Failures: 0, Errors: 0, Skipped: 0, Time elapsed: 12.327 sec - in org.apache.hadoop.yarn.server.resourcemanager.metrics.TestSystemMetricsPublisher
Running org.apache.hadoop.yarn.server.resourcemanager.TestKillApplicationWithRMHA
Tests run: 4, Failures: 0, Errors: 0, Skipped: 0, Time elapsed: 30.065 sec - in org.apache.hadoop.yarn.server.resourcemanager.TestKillApplicationWithRMHA

Results :

Failed tests: 
  TestRMApplicationHistoryWriter.testRMWritingMassiveHistoryForCapacitySche:383->testRMWritingMassiveHistory:431->testRMWritingMassiveHistory:470
expected:<10000> but was:<9936>
  TestCapacityScheduler.testQueueHierarchyPendingResourceUpdate:2836->checkPendingResource:2846
expected:<0> but was:<8192>

Tests in error: 
  TestSchedulingPolicy.testIsApplicableTo:116 »  test timed out after 1000 milli...
  TestEmptyQueues.testFifoPolicy:44 »  test timed out after 1000 milliseconds
  TestAMRestart.testAMRestartNotLostContainerCompleteMsg:948 »  test timed out a...

Tests run: 1349, Failures: 2, Errors: 3, Skipped: 3

[INFO] ------------------------------------------------------------------------
[INFO] Reactor Summary:
[INFO] 
[INFO] Apache Hadoop YARN ................................ SUCCESS [  5.544 s]
[INFO] Apache Hadoop YARN API ............................ SUCCESS [06:51 min]
[INFO] Apache Hadoop YARN Common ......................... SUCCESS [05:07 min]
[INFO] Apache Hadoop YARN Server ......................... SUCCESS [  0.135 s]
[INFO] Apache Hadoop YARN Server Common .................. SUCCESS [01:25 min]
[INFO] Apache Hadoop YARN NodeManager .................... SUCCESS [13:09 min]
[INFO] Apache Hadoop YARN Web Proxy ...................... SUCCESS [ 48.145 s]
[INFO] Apache Hadoop YARN ApplicationHistoryService ...... SUCCESS [05:06 min]
[INFO] Apache Hadoop YARN ResourceManager ................ FAILURE [  01:38 h]
[INFO] Apache Hadoop YARN Server Tests ................... SKIPPED
[INFO] Apache Hadoop YARN Client ......................... SKIPPED
[INFO] Apache Hadoop YARN SharedCacheManager ............. SKIPPED
[INFO] Apache Hadoop YARN Timeline Plugin Storage ........ SKIPPED
[INFO] Apache Hadoop YARN Applications ................... SKIPPED
[INFO] Apache Hadoop YARN DistributedShell ............... SKIPPED
[INFO] Apache Hadoop YARN Unmanaged Am Launcher .......... SKIPPED
[INFO] Apache Hadoop YARN Site ........................... SKIPPED
[INFO] Apache Hadoop YARN Registry ....................... SKIPPED
[INFO] Apache Hadoop YARN Project ........................ SKIPPED
[INFO] ------------------------------------------------------------------------
[INFO] BUILD FAILURE
[INFO] ------------------------------------------------------------------------
[INFO] Total time: 02:10 h
[INFO] Finished at: 2016-04-17T08:10:32+00:00
[INFO] Final Memory: 64M/566M
[INFO] ------------------------------------------------------------------------
[ERROR] Failed to execute goal org.apache.maven.plugins:maven-surefire-plugin:2.17:test (default-test)
on project hadoop-yarn-server-resourcemanager: There was a timeout or other error in the fork
-> [Help 1]
[ERROR] 
[ERROR] To see the full stack trace of the errors, re-run Maven with the -e switch.
[ERROR] Re-run Maven using the -X switch to enable full debug logging.
[ERROR] 
[ERROR] For more information about the errors and possible solutions, please read the following
articles:
[ERROR] [Help 1] http://cwiki.apache.org/confluence/display/MAVEN/MojoFailureException
[ERROR] 
[ERROR] After correcting the problems, you can resume the build with the command
[ERROR]   mvn <goals> -rf :hadoop-yarn-server-resourcemanager
Build step 'Execute shell' marked build as failure
Archiving artifacts
Recording test results

Mime
View raw message