hadoop-yarn-dev mailing list archives

Site index · List index
Message view « Date » · « Thread »
Top « Date » · « Thread »
From Apache Jenkins Server <jenk...@builds.apache.org>
Subject Hadoop-Yarn-trunk - Build # 2078 - Still Failing
Date Wed, 27 Apr 2016 17:46:39 GMT
See https://builds.apache.org/job/Hadoop-Yarn-trunk/2078/

###################################################################################
########################## LAST 60 LINES OF THE CONSOLE ###########################
[...truncated 9445 lines...]
Tests run: 1, Failures: 0, Errors: 0, Skipped: 0, Time elapsed: 0.904 sec - in org.apache.hadoop.yarn.server.resourcemanager.placement.TestUserGroupMappingPlacementRule
Running org.apache.hadoop.yarn.server.resourcemanager.rmcontainer.TestRMContainerImpl
Tests run: 5, Failures: 0, Errors: 0, Skipped: 0, Time elapsed: 21.641 sec - in org.apache.hadoop.yarn.server.resourcemanager.rmcontainer.TestRMContainerImpl
Running org.apache.hadoop.yarn.server.resourcemanager.TestApplicationMasterService
Tests run: 8, Failures: 0, Errors: 0, Skipped: 0, Time elapsed: 50.636 sec - in org.apache.hadoop.yarn.server.resourcemanager.TestApplicationMasterService
Running org.apache.hadoop.yarn.server.resourcemanager.TestRMRestart
Tests run: 28, Failures: 0, Errors: 0, Skipped: 0, Time elapsed: 269.462 sec - in org.apache.hadoop.yarn.server.resourcemanager.TestRMRestart
Running org.apache.hadoop.yarn.webapp.TestRMWithCSRFFilter
Tests run: 4, Failures: 0, Errors: 0, Skipped: 0, Time elapsed: 5.925 sec - in org.apache.hadoop.yarn.webapp.TestRMWithCSRFFilter

Results :

Tests run: 1354, Failures: 0, Errors: 0, Skipped: 3

[INFO] ------------------------------------------------------------------------
[INFO] Reactor Summary:
[INFO] 
[INFO] Apache Hadoop YARN ................................ SUCCESS [  3.994 s]
[INFO] Apache Hadoop YARN API ............................ SUCCESS [05:09 min]
[INFO] Apache Hadoop YARN Common ......................... SUCCESS [03:48 min]
[INFO] Apache Hadoop YARN Server ......................... SUCCESS [  0.100 s]
[INFO] Apache Hadoop YARN Server Common .................. SUCCESS [01:10 min]
[INFO] Apache Hadoop YARN NodeManager .................... SUCCESS [13:05 min]
[INFO] Apache Hadoop YARN Web Proxy ...................... SUCCESS [ 31.853 s]
[INFO] Apache Hadoop YARN ApplicationHistoryService ...... SUCCESS [03:53 min]
[INFO] Apache Hadoop YARN ResourceManager ................ FAILURE [  01:18 h]
[INFO] Apache Hadoop YARN Server Tests ................... SKIPPED
[INFO] Apache Hadoop YARN Client ......................... SKIPPED
[INFO] Apache Hadoop YARN SharedCacheManager ............. SKIPPED
[INFO] Apache Hadoop YARN Timeline Plugin Storage ........ SKIPPED
[INFO] Apache Hadoop YARN Applications ................... SKIPPED
[INFO] Apache Hadoop YARN DistributedShell ............... SKIPPED
[INFO] Apache Hadoop YARN Unmanaged Am Launcher .......... SKIPPED
[INFO] Apache Hadoop YARN Site ........................... SKIPPED
[INFO] Apache Hadoop YARN Registry ....................... SKIPPED
[INFO] Apache Hadoop YARN Project ........................ SKIPPED
[INFO] ------------------------------------------------------------------------
[INFO] BUILD FAILURE
[INFO] ------------------------------------------------------------------------
[INFO] Total time: 01:46 h
[INFO] Finished at: 2016-04-27T17:46:30+00:00
[INFO] Final Memory: 64M/501M
[INFO] ------------------------------------------------------------------------
[ERROR] Failed to execute goal org.apache.maven.plugins:maven-surefire-plugin:2.17:test (default-test)
on project hadoop-yarn-server-resourcemanager: There was a timeout or other error in the fork
-> [Help 1]
[ERROR] 
[ERROR] To see the full stack trace of the errors, re-run Maven with the -e switch.
[ERROR] Re-run Maven using the -X switch to enable full debug logging.
[ERROR] 
[ERROR] For more information about the errors and possible solutions, please read the following
articles:
[ERROR] [Help 1] http://cwiki.apache.org/confluence/display/MAVEN/MojoFailureException
[ERROR] 
[ERROR] After correcting the problems, you can resume the build with the command
[ERROR]   mvn <goals> -rf :hadoop-yarn-server-resourcemanager
Build step 'Execute shell' marked build as failure
Archiving artifacts
Recording test results
Sending e-mails to: yarn-dev@hadoop.apache.org
Email was triggered for: Failure - Any
Sending email for trigger: Failure - Any



###################################################################################
############################## FAILED TESTS (if any) ##############################
All tests passed
Mime
  • Unnamed multipart/mixed (inline, None, 0 bytes)
View raw message