hadoop-yarn-dev mailing list archives

Site index · List index
Message view « Date » · « Thread »
Top « Date » · « Thread »
From Apache Jenkins Server <jenk...@builds.apache.org>
Subject Hadoop-Yarn-trunk - Build # 2029 - Still Failing
Date Mon, 18 Apr 2016 02:37:49 GMT
See https://builds.apache.org/job/Hadoop-Yarn-trunk/2029/

###################################################################################
########################## LAST 60 LINES OF THE CONSOLE ###########################
[...truncated 8803 lines...]
Tests run: 2, Failures: 0, Errors: 0, Skipped: 0, Time elapsed: 3.183 sec - in org.apache.hadoop.yarn.server.timeline.recovery.TestLeveldbTimelineStateStore
Running org.apache.hadoop.yarn.server.timeline.TestTimelineDataManager
Tests run: 4, Failures: 0, Errors: 0, Skipped: 0, Time elapsed: 8.025 sec - in org.apache.hadoop.yarn.server.timeline.TestTimelineDataManager

Results :

Tests in error: 
  TestTimelineAuthenticationFilter.testPutTimelineEntities:178 ยป ClientHandler j...

Tests run: 197, Failures: 0, Errors: 1, Skipped: 0

[INFO] ------------------------------------------------------------------------
[INFO] Reactor Summary:
[INFO] 
[INFO] Apache Hadoop YARN ................................ SUCCESS [  7.260 s]
[INFO] Apache Hadoop YARN API ............................ SUCCESS [07:50 min]
[INFO] Apache Hadoop YARN Common ......................... SUCCESS [06:16 min]
[INFO] Apache Hadoop YARN Server ......................... SUCCESS [  0.138 s]
[INFO] Apache Hadoop YARN Server Common .................. SUCCESS [01:41 min]
[INFO] Apache Hadoop YARN NodeManager .................... SUCCESS [15:08 min]
[INFO] Apache Hadoop YARN Web Proxy ...................... SUCCESS [ 54.582 s]
[INFO] Apache Hadoop YARN ApplicationHistoryService ...... FAILURE [04:59 min]
[INFO] Apache Hadoop YARN ResourceManager ................ SKIPPED
[INFO] Apache Hadoop YARN Server Tests ................... SKIPPED
[INFO] Apache Hadoop YARN Client ......................... SKIPPED
[INFO] Apache Hadoop YARN SharedCacheManager ............. SKIPPED
[INFO] Apache Hadoop YARN Timeline Plugin Storage ........ SKIPPED
[INFO] Apache Hadoop YARN Applications ................... SKIPPED
[INFO] Apache Hadoop YARN DistributedShell ............... SKIPPED
[INFO] Apache Hadoop YARN Unmanaged Am Launcher .......... SKIPPED
[INFO] Apache Hadoop YARN Site ........................... SKIPPED
[INFO] Apache Hadoop YARN Registry ....................... SKIPPED
[INFO] Apache Hadoop YARN Project ........................ SKIPPED
[INFO] ------------------------------------------------------------------------
[INFO] BUILD FAILURE
[INFO] ------------------------------------------------------------------------
[INFO] Total time: 37:02 min
[INFO] Finished at: 2016-04-18T02:37:42+00:00
[INFO] Final Memory: 83M/985M
[INFO] ------------------------------------------------------------------------
[ERROR] Failed to execute goal org.apache.maven.plugins:maven-surefire-plugin:2.17:test (default-test)
on project hadoop-yarn-server-applicationhistoryservice: There are test failures.
[ERROR] 
[ERROR] Please refer to /home/jenkins/jenkins-slave/workspace/Hadoop-Yarn-trunk/hadoop-yarn-project/hadoop-yarn/hadoop-yarn-server/hadoop-yarn-server-applicationhistoryservice/target/surefire-reports
for the individual test results.
[ERROR] -> [Help 1]
[ERROR] 
[ERROR] To see the full stack trace of the errors, re-run Maven with the -e switch.
[ERROR] Re-run Maven using the -X switch to enable full debug logging.
[ERROR] 
[ERROR] For more information about the errors and possible solutions, please read the following
articles:
[ERROR] [Help 1] http://cwiki.apache.org/confluence/display/MAVEN/MojoFailureException
[ERROR] 
[ERROR] After correcting the problems, you can resume the build with the command
[ERROR]   mvn <goals> -rf :hadoop-yarn-server-applicationhistoryservice
Build step 'Execute shell' marked build as failure
Archiving artifacts
Recording test results
Sending e-mails to: yarn-dev@hadoop.apache.org
Email was triggered for: Failure - Any
Sending email for trigger: Failure - Any



###################################################################################
############################## FAILED TESTS (if any) ##############################
1 tests failed.
FAILED:  org.apache.hadoop.yarn.server.timeline.security.TestTimelineAuthenticationFilter.testPutTimelineEntities[1]

Error Message:
java.io.IOException: org.apache.hadoop.security.authentication.client.AuthenticationException:
GSSException: No valid credentials provided (Mechanism level: Cannot get a KDC reply)

Stack Trace:
com.sun.jersey.api.client.ClientHandlerException: java.io.IOException: org.apache.hadoop.security.authentication.client.AuthenticationException:
GSSException: No valid credentials provided (Mechanism level: Cannot get a KDC reply)
	at sun.security.krb5.KdcComm.send(KdcComm.java:250)
	at sun.security.krb5.KdcComm.send(KdcComm.java:191)
	at sun.security.krb5.KrbTgsReq.send(KrbTgsReq.java:187)
	at sun.security.krb5.KrbTgsReq.sendAndGetCreds(KrbTgsReq.java:202)
	at sun.security.krb5.internal.CredentialsUtil.serviceCreds(CredentialsUtil.java:311)
	at sun.security.krb5.internal.CredentialsUtil.acquireServiceCreds(CredentialsUtil.java:115)
	at sun.security.krb5.Credentials.acquireServiceCreds(Credentials.java:449)
	at sun.security.jgss.krb5.Krb5Context.initSecContext(Krb5Context.java:641)
	at sun.security.jgss.GSSContextImpl.initSecContext(GSSContextImpl.java:248)
	at sun.security.jgss.GSSContextImpl.initSecContext(GSSContextImpl.java:179)
	at org.apache.hadoop.security.authentication.client.KerberosAuthenticator$1.run(KerberosAuthenticator.java:309)
	at org.apache.hadoop.security.authentication.client.KerberosAuthenticator$1.run(KerberosAuthenticator.java:285)
	at java.security.AccessController.doPrivileged(Native Method)
	at javax.security.auth.Subject.doAs(Subject.java:415)
	at org.apache.hadoop.security.authentication.client.KerberosAuthenticator.doSpnegoSequence(KerberosAuthenticator.java:285)
	at org.apache.hadoop.security.authentication.client.KerberosAuthenticator.authenticate(KerberosAuthenticator.java:203)
	at org.apache.hadoop.security.token.delegation.web.DelegationTokenAuthenticator.authenticate(DelegationTokenAuthenticator.java:128)
	at org.apache.hadoop.security.authentication.client.AuthenticatedURL.openConnection(AuthenticatedURL.java:216)
	at org.apache.hadoop.security.token.delegation.web.DelegationTokenAuthenticatedURL.openConnection(DelegationTokenAuthenticatedURL.java:322)
	at org.apache.hadoop.yarn.client.api.impl.TimelineClientImpl$TimelineURLConnectionFactory.getHttpURLConnection(TimelineClientImpl.java:484)
	at com.sun.jersey.client.urlconnection.URLConnectionClientHandler._invoke(URLConnectionClientHandler.java:159)
	at com.sun.jersey.client.urlconnection.URLConnectionClientHandler.handle(URLConnectionClientHandler.java:147)
	at org.apache.hadoop.yarn.client.api.impl.TimelineClientImpl$TimelineJerseyRetryFilter$1.run(TimelineClientImpl.java:233)
	at org.apache.hadoop.yarn.client.api.impl.TimelineClientImpl$TimelineClientConnectionRetry.retryOn(TimelineClientImpl.java:182)
	at org.apache.hadoop.yarn.client.api.impl.TimelineClientImpl$TimelineJerseyRetryFilter.handle(TimelineClientImpl.java:244)
	at com.sun.jersey.api.client.Client.handle(Client.java:648)
	at com.sun.jersey.api.client.WebResource.handle(WebResource.java:670)
	at com.sun.jersey.api.client.WebResource.access$200(WebResource.java:74)
	at com.sun.jersey.api.client.WebResource$Builder.post(WebResource.java:563)
	at org.apache.hadoop.yarn.client.api.impl.TimelineWriter.doPostingObject(TimelineWriter.java:154)
	at org.apache.hadoop.yarn.client.api.impl.TimelineWriter$1.run(TimelineWriter.java:115)
	at org.apache.hadoop.yarn.client.api.impl.TimelineWriter$1.run(TimelineWriter.java:112)
	at java.security.AccessController.doPrivileged(Native Method)
	at javax.security.auth.Subject.doAs(Subject.java:415)
	at org.apache.hadoop.security.UserGroupInformation.doAs(UserGroupInformation.java:1742)
	at org.apache.hadoop.yarn.client.api.impl.TimelineWriter.doPosting(TimelineWriter.java:112)
	at org.apache.hadoop.yarn.client.api.impl.TimelineWriter.putEntities(TimelineWriter.java:92)
	at org.apache.hadoop.yarn.client.api.impl.TimelineClientImpl.putEntities(TimelineClientImpl.java:338)
	at org.apache.hadoop.yarn.server.timeline.security.TestTimelineAuthenticationFilter$1.call(TestTimelineAuthenticationFilter.java:187)
	at org.apache.hadoop.yarn.server.timeline.security.TestTimelineAuthenticationFilter$1.call(TestTimelineAuthenticationFilter.java:178)
	at org.apache.hadoop.security.authentication.KerberosTestUtils$1.run(KerberosTestUtils.java:120)
	at java.security.AccessController.doPrivileged(Native Method)
	at javax.security.auth.Subject.doAs(Subject.java:415)
	at org.apache.hadoop.security.authentication.KerberosTestUtils.doAs(KerberosTestUtils.java:117)
	at org.apache.hadoop.yarn.server.timeline.security.TestTimelineAuthenticationFilter.testPutTimelineEntities(TestTimelineAuthenticationFilter.java:178)



Mime
  • Unnamed multipart/mixed (inline, None, 0 bytes)
View raw message