hadoop-yarn-dev mailing list archives

Site index · List index
Message view « Date » · « Thread »
Top « Date » · « Thread »
From Apache Jenkins Server <jenk...@builds.apache.org>
Subject Build failed in Jenkins: Hadoop-Yarn-trunk #1989
Date Fri, 08 Apr 2016 01:15:56 GMT
See <https://builds.apache.org/job/Hadoop-Yarn-trunk/1989/changes>

Changes:

[kasha] YARN-4756. Unnecessary wait in Node Status Updater during reboot. (Eric

------------------------------------------
[...truncated 7792 lines...]
	at java.security.AccessController.doPrivileged(Native Method)
	at javax.security.auth.Subject.doAs(Subject.java:415)
	at org.apache.hadoop.security.UserGroupInformation.doAs(UserGroupInformation.java:1742)
	at org.apache.hadoop.fs.FileContext.getAbstractFileSystem(FileContext.java:329)
	at org.apache.hadoop.fs.FileContext.getFileContext(FileContext.java:446)
	at org.apache.hadoop.fs.FileContext.getFileContext(FileContext.java:423)
	at org.apache.hadoop.fs.FileContext.getLocalFSFileContext(FileContext.java:409)
	at org.apache.hadoop.yarn.server.nodemanager.TestNodeStatusUpdater.deleteBaseDir(TestNodeStatusUpdater.java:958)

testConcurrentAccessToSystemCredentials(org.apache.hadoop.yarn.server.nodemanager.TestNodeStatusUpdater)
 Time elapsed: 0.028 sec  <<< ERROR!
org.apache.hadoop.fs.UnsupportedFileSystemException: fs.AbstractFileSystem.file.impl=null:
No AbstractFileSystem configured for scheme: file
	at org.apache.hadoop.fs.AbstractFileSystem.createFileSystem(AbstractFileSystem.java:161)
	at org.apache.hadoop.fs.AbstractFileSystem.get(AbstractFileSystem.java:250)
	at org.apache.hadoop.fs.FileContext$2.run(FileContext.java:332)
	at org.apache.hadoop.fs.FileContext$2.run(FileContext.java:329)
	at java.security.AccessController.doPrivileged(Native Method)
	at javax.security.auth.Subject.doAs(Subject.java:415)
	at org.apache.hadoop.security.UserGroupInformation.doAs(UserGroupInformation.java:1742)
	at org.apache.hadoop.fs.FileContext.getAbstractFileSystem(FileContext.java:329)
	at org.apache.hadoop.fs.FileContext.getFileContext(FileContext.java:446)
	at org.apache.hadoop.fs.FileContext.getFileContext(FileContext.java:423)
	at org.apache.hadoop.fs.FileContext.getLocalFSFileContext(FileContext.java:409)
	at org.apache.hadoop.yarn.server.nodemanager.TestNodeStatusUpdater.deleteBaseDir(TestNodeStatusUpdater.java:958)

testCompletedContainersIsRecentlyStopped(org.apache.hadoop.yarn.server.nodemanager.TestNodeStatusUpdater)
 Time elapsed: 0.024 sec  <<< ERROR!
java.lang.RuntimeException: java.lang.reflect.InvocationTargetException
	at org.apache.hadoop.fs.AbstractFileSystem.createFileSystem(AbstractFileSystem.java:161)
	at org.apache.hadoop.fs.AbstractFileSystem.get(AbstractFileSystem.java:250)
	at org.apache.hadoop.fs.FileContext$2.run(FileContext.java:332)
	at org.apache.hadoop.fs.FileContext$2.run(FileContext.java:329)
	at java.security.AccessController.doPrivileged(Native Method)
	at javax.security.auth.Subject.doAs(Subject.java:415)
	at org.apache.hadoop.security.UserGroupInformation.doAs(UserGroupInformation.java:1742)
	at org.apache.hadoop.fs.FileContext.getAbstractFileSystem(FileContext.java:329)
	at org.apache.hadoop.fs.FileContext.getFileContext(FileContext.java:446)
	at org.apache.hadoop.fs.FileContext.getFileContext(FileContext.java:423)
	at org.apache.hadoop.fs.FileContext.getLocalFSFileContext(FileContext.java:409)
	at org.apache.hadoop.yarn.server.nodemanager.DefaultContainerExecutor.<init>(DefaultContainerExecutor.java:81)
	at sun.reflect.GeneratedConstructorAccessor82.newInstance(Unknown Source)
	at sun.reflect.DelegatingConstructorAccessorImpl.newInstance(DelegatingConstructorAccessorImpl.java:45)
	at java.lang.reflect.Constructor.newInstance(Constructor.java:526)
	at org.apache.hadoop.util.ReflectionUtils.newInstance(ReflectionUtils.java:132)
	at org.apache.hadoop.yarn.server.nodemanager.NodeManager.serviceInit(NodeManager.java:293)
	at org.apache.hadoop.service.AbstractService.init(AbstractService.java:163)
	at org.apache.hadoop.yarn.server.nodemanager.TestNodeStatusUpdater.testCompletedContainersIsRecentlyStopped(TestNodeStatusUpdater.java:1084)

testCompletedContainersIsRecentlyStopped(org.apache.hadoop.yarn.server.nodemanager.TestNodeStatusUpdater)
 Time elapsed: 0.025 sec  <<< ERROR!
org.apache.hadoop.fs.UnsupportedFileSystemException: fs.AbstractFileSystem.file.impl=null:
No AbstractFileSystem configured for scheme: file
	at org.apache.hadoop.fs.AbstractFileSystem.createFileSystem(AbstractFileSystem.java:161)
	at org.apache.hadoop.fs.AbstractFileSystem.get(AbstractFileSystem.java:250)
	at org.apache.hadoop.fs.FileContext$2.run(FileContext.java:332)
	at org.apache.hadoop.fs.FileContext$2.run(FileContext.java:329)
	at java.security.AccessController.doPrivileged(Native Method)
	at javax.security.auth.Subject.doAs(Subject.java:415)
	at org.apache.hadoop.security.UserGroupInformation.doAs(UserGroupInformation.java:1742)
	at org.apache.hadoop.fs.FileContext.getAbstractFileSystem(FileContext.java:329)
	at org.apache.hadoop.fs.FileContext.getFileContext(FileContext.java:446)
	at org.apache.hadoop.fs.FileContext.getFileContext(FileContext.java:423)
	at org.apache.hadoop.fs.FileContext.getLocalFSFileContext(FileContext.java:409)
	at org.apache.hadoop.yarn.server.nodemanager.TestNodeStatusUpdater.deleteBaseDir(TestNodeStatusUpdater.java:958)

Running org.apache.hadoop.yarn.server.nodemanager.metrics.TestNodeManagerMetrics
Tests run: 1, Failures: 0, Errors: 0, Skipped: 0, Time elapsed: 0.824 sec - in org.apache.hadoop.yarn.server.nodemanager.metrics.TestNodeManagerMetrics
Running org.apache.hadoop.yarn.server.nodemanager.TestNodeHealthService
Tests run: 1, Failures: 0, Errors: 0, Skipped: 0, Time elapsed: 1.25 sec - in org.apache.hadoop.yarn.server.nodemanager.TestNodeHealthService
Running org.apache.hadoop.yarn.server.nodemanager.TestDockerContainerExecutor
Tests run: 1, Failures: 0, Errors: 0, Skipped: 0, Time elapsed: 14.381 sec - in org.apache.hadoop.yarn.server.nodemanager.TestDockerContainerExecutor
Running org.apache.hadoop.yarn.server.nodemanager.security.TestNMContainerTokenSecretManager
Tests run: 1, Failures: 0, Errors: 0, Skipped: 0, Time elapsed: 1.367 sec - in org.apache.hadoop.yarn.server.nodemanager.security.TestNMContainerTokenSecretManager
Running org.apache.hadoop.yarn.server.nodemanager.security.TestNMTokenSecretManagerInNM
Tests run: 1, Failures: 0, Errors: 0, Skipped: 0, Time elapsed: 1.219 sec - in org.apache.hadoop.yarn.server.nodemanager.security.TestNMTokenSecretManagerInNM
Running org.apache.hadoop.yarn.server.nodemanager.TestDeletionService
Tests run: 6, Failures: 0, Errors: 0, Skipped: 0, Time elapsed: 23.211 sec - in org.apache.hadoop.yarn.server.nodemanager.TestDeletionService
Running org.apache.hadoop.yarn.server.nodemanager.TestNodeStatusUpdaterForLabels
Tests run: 2, Failures: 0, Errors: 0, Skipped: 0, Time elapsed: 11.575 sec - in org.apache.hadoop.yarn.server.nodemanager.TestNodeStatusUpdaterForLabels
Running org.apache.hadoop.yarn.server.nodemanager.nodelabels.TestConfigurationNodeLabelsProvider
Tests run: 3, Failures: 0, Errors: 0, Skipped: 0, Time elapsed: 4.64 sec - in org.apache.hadoop.yarn.server.nodemanager.nodelabels.TestConfigurationNodeLabelsProvider
Running org.apache.hadoop.yarn.server.nodemanager.nodelabels.TestScriptBasedNodeLabelsProvider
Tests run: 3, Failures: 0, Errors: 0, Skipped: 0, Time elapsed: 5.737 sec - in org.apache.hadoop.yarn.server.nodemanager.nodelabels.TestScriptBasedNodeLabelsProvider
Running org.apache.hadoop.yarn.server.nodemanager.api.protocolrecords.impl.pb.TestPBLocalizerRPC
Tests run: 1, Failures: 0, Errors: 0, Skipped: 0, Time elapsed: 1.078 sec - in org.apache.hadoop.yarn.server.nodemanager.api.protocolrecords.impl.pb.TestPBLocalizerRPC
Running org.apache.hadoop.yarn.server.nodemanager.api.protocolrecords.impl.pb.TestPBRecordImpl
Tests run: 4, Failures: 0, Errors: 0, Skipped: 0, Time elapsed: 0.619 sec - in org.apache.hadoop.yarn.server.nodemanager.api.protocolrecords.impl.pb.TestPBRecordImpl
Running org.apache.hadoop.yarn.server.nodemanager.containermanager.monitor.TestContainerMetrics
Tests run: 4, Failures: 0, Errors: 0, Skipped: 0, Time elapsed: 2.434 sec - in org.apache.hadoop.yarn.server.nodemanager.containermanager.monitor.TestContainerMetrics
Running org.apache.hadoop.yarn.server.nodemanager.containermanager.monitor.TestContainersMonitor
Tests run: 3, Failures: 0, Errors: 0, Skipped: 0, Time elapsed: 7.592 sec - in org.apache.hadoop.yarn.server.nodemanager.containermanager.monitor.TestContainersMonitor
Running org.apache.hadoop.yarn.server.nodemanager.containermanager.monitor.TestContainersMonitorResourceChange
Tests run: 2, Failures: 0, Errors: 0, Skipped: 0, Time elapsed: 2.73 sec - in org.apache.hadoop.yarn.server.nodemanager.containermanager.monitor.TestContainersMonitorResourceChange
Running org.apache.hadoop.yarn.server.nodemanager.containermanager.application.TestApplication
Tests run: 8, Failures: 0, Errors: 0, Skipped: 0, Time elapsed: 5.644 sec - in org.apache.hadoop.yarn.server.nodemanager.containermanager.application.TestApplication
Running org.apache.hadoop.yarn.server.nodemanager.containermanager.TestContainerManager
Tests run: 16, Failures: 0, Errors: 0, Skipped: 0, Time elapsed: 46.448 sec - in org.apache.hadoop.yarn.server.nodemanager.containermanager.TestContainerManager
Running org.apache.hadoop.yarn.server.nodemanager.containermanager.linux.privileged.TestPrivilegedOperationExecutor
Tests run: 4, Failures: 0, Errors: 0, Skipped: 0, Time elapsed: 0.774 sec - in org.apache.hadoop.yarn.server.nodemanager.containermanager.linux.privileged.TestPrivilegedOperationExecutor
Running org.apache.hadoop.yarn.server.nodemanager.containermanager.linux.resources.TestTrafficControlBandwidthHandlerImpl
Tests run: 2, Failures: 0, Errors: 0, Skipped: 0, Time elapsed: 0.934 sec - in org.apache.hadoop.yarn.server.nodemanager.containermanager.linux.resources.TestTrafficControlBandwidthHandlerImpl
Running org.apache.hadoop.yarn.server.nodemanager.containermanager.linux.resources.TestResourceHandlerModule
Tests run: 2, Failures: 0, Errors: 0, Skipped: 0, Time elapsed: 0.846 sec - in org.apache.hadoop.yarn.server.nodemanager.containermanager.linux.resources.TestResourceHandlerModule
Running org.apache.hadoop.yarn.server.nodemanager.containermanager.linux.resources.TestCGroupsHandlerImpl
Tests run: 4, Failures: 0, Errors: 0, Skipped: 0, Time elapsed: 1.015 sec - in org.apache.hadoop.yarn.server.nodemanager.containermanager.linux.resources.TestCGroupsHandlerImpl
Running org.apache.hadoop.yarn.server.nodemanager.containermanager.linux.resources.TestTrafficController
Tests run: 5, Failures: 0, Errors: 0, Skipped: 0, Time elapsed: 1.028 sec - in org.apache.hadoop.yarn.server.nodemanager.containermanager.linux.resources.TestTrafficController
Running org.apache.hadoop.yarn.server.nodemanager.containermanager.linux.resources.TestCGroupsCpuResourceHandlerImpl
Tests run: 10, Failures: 0, Errors: 0, Skipped: 0, Time elapsed: 1.192 sec - in org.apache.hadoop.yarn.server.nodemanager.containermanager.linux.resources.TestCGroupsCpuResourceHandlerImpl
Running org.apache.hadoop.yarn.server.nodemanager.containermanager.linux.resources.TestCGroupsBlkioResourceHandlerImpl
Tests run: 5, Failures: 0, Errors: 0, Skipped: 0, Time elapsed: 0.502 sec - in org.apache.hadoop.yarn.server.nodemanager.containermanager.linux.resources.TestCGroupsBlkioResourceHandlerImpl
Running org.apache.hadoop.yarn.server.nodemanager.containermanager.linux.resources.TestCGroupsMemoryResourceHandlerImpl
Tests run: 6, Failures: 0, Errors: 0, Skipped: 0, Time elapsed: 0.971 sec - in org.apache.hadoop.yarn.server.nodemanager.containermanager.linux.resources.TestCGroupsMemoryResourceHandlerImpl
Running org.apache.hadoop.yarn.server.nodemanager.containermanager.linux.runtime.TestDockerContainerRuntime
Tests run: 8, Failures: 0, Errors: 0, Skipped: 0, Time elapsed: 1.403 sec - in org.apache.hadoop.yarn.server.nodemanager.containermanager.linux.runtime.TestDockerContainerRuntime
Running org.apache.hadoop.yarn.server.nodemanager.containermanager.TestAuxServices
Tests run: 6, Failures: 0, Errors: 0, Skipped: 0, Time elapsed: 1.424 sec - in org.apache.hadoop.yarn.server.nodemanager.containermanager.TestAuxServices
Running org.apache.hadoop.yarn.server.nodemanager.containermanager.TestNMProxy
Tests run: 3, Failures: 0, Errors: 0, Skipped: 0, Time elapsed: 5.703 sec - in org.apache.hadoop.yarn.server.nodemanager.containermanager.TestNMProxy
Running org.apache.hadoop.yarn.server.nodemanager.containermanager.loghandler.TestNonAggregatingLogHandler
Tests run: 6, Failures: 0, Errors: 0, Skipped: 0, Time elapsed: 1.752 sec - in org.apache.hadoop.yarn.server.nodemanager.containermanager.loghandler.TestNonAggregatingLogHandler
Running org.apache.hadoop.yarn.server.nodemanager.containermanager.localizer.TestContainerLocalizer
Tests run: 3, Failures: 0, Errors: 0, Skipped: 0, Time elapsed: 1.648 sec - in org.apache.hadoop.yarn.server.nodemanager.containermanager.localizer.TestContainerLocalizer
Running org.apache.hadoop.yarn.server.nodemanager.containermanager.localizer.TestLocalResource
Tests run: 2, Failures: 0, Errors: 0, Skipped: 0, Time elapsed: 0.424 sec - in org.apache.hadoop.yarn.server.nodemanager.containermanager.localizer.TestLocalResource
Running org.apache.hadoop.yarn.server.nodemanager.containermanager.localizer.TestLocalResourcesTrackerImpl
Tests run: 11, Failures: 0, Errors: 0, Skipped: 0, Time elapsed: 1.631 sec - in org.apache.hadoop.yarn.server.nodemanager.containermanager.localizer.TestLocalResourcesTrackerImpl
Running org.apache.hadoop.yarn.server.nodemanager.containermanager.localizer.TestLocalizedResource
Tests run: 1, Failures: 0, Errors: 0, Skipped: 0, Time elapsed: 0.659 sec - in org.apache.hadoop.yarn.server.nodemanager.containermanager.localizer.TestLocalizedResource
Running org.apache.hadoop.yarn.server.nodemanager.containermanager.localizer.sharedcache.TestSharedCacheUploadService
Tests run: 2, Failures: 0, Errors: 0, Skipped: 0, Time elapsed: 0.871 sec - in org.apache.hadoop.yarn.server.nodemanager.containermanager.localizer.sharedcache.TestSharedCacheUploadService
Running org.apache.hadoop.yarn.server.nodemanager.containermanager.localizer.sharedcache.TestSharedCacheUploader
Tests run: 6, Failures: 0, Errors: 0, Skipped: 0, Time elapsed: 1.234 sec - in org.apache.hadoop.yarn.server.nodemanager.containermanager.localizer.sharedcache.TestSharedCacheUploader
Running org.apache.hadoop.yarn.server.nodemanager.containermanager.localizer.TestResourceLocalizationService
Tests run: 14, Failures: 0, Errors: 0, Skipped: 0, Time elapsed: 6.425 sec - in org.apache.hadoop.yarn.server.nodemanager.containermanager.localizer.TestResourceLocalizationService
Running org.apache.hadoop.yarn.server.nodemanager.containermanager.localizer.TestResourceRetention
Tests run: 1, Failures: 0, Errors: 0, Skipped: 0, Time elapsed: 0.987 sec - in org.apache.hadoop.yarn.server.nodemanager.containermanager.localizer.TestResourceRetention
Running org.apache.hadoop.yarn.server.nodemanager.containermanager.localizer.TestLocalCacheDirectoryManager
Tests run: 5, Failures: 0, Errors: 0, Skipped: 0, Time elapsed: 1.611 sec - in org.apache.hadoop.yarn.server.nodemanager.containermanager.localizer.TestLocalCacheDirectoryManager
Running org.apache.hadoop.yarn.server.nodemanager.containermanager.TestContainerManagerRecovery
Tests run: 3, Failures: 0, Errors: 0, Skipped: 0, Time elapsed: 42.079 sec - in org.apache.hadoop.yarn.server.nodemanager.containermanager.TestContainerManagerRecovery
Running org.apache.hadoop.yarn.server.nodemanager.containermanager.launcher.TestContainerLaunch
Tests run: 23, Failures: 0, Errors: 0, Skipped: 5, Time elapsed: 22.134 sec - in org.apache.hadoop.yarn.server.nodemanager.containermanager.launcher.TestContainerLaunch
Running org.apache.hadoop.yarn.server.nodemanager.containermanager.logaggregation.TestLogAggregationService
Tests run: 41, Failures: 0, Errors: 0, Skipped: 0, Time elapsed: 130.071 sec - in org.apache.hadoop.yarn.server.nodemanager.containermanager.logaggregation.TestLogAggregationService
Running org.apache.hadoop.yarn.server.nodemanager.containermanager.container.TestContainer
Tests run: 20, Failures: 0, Errors: 0, Skipped: 0, Time elapsed: 2.614 sec - in org.apache.hadoop.yarn.server.nodemanager.containermanager.container.TestContainer
Running org.apache.hadoop.yarn.server.nodemanager.TestNodeManager
Tests run: 2, Failures: 0, Errors: 0, Skipped: 0, Time elapsed: 1.274 sec - in org.apache.hadoop.yarn.server.nodemanager.TestNodeManager
Running org.apache.hadoop.yarn.server.nodemanager.util.TestCgroupsLCEResourcesHandler
Tests run: 5, Failures: 0, Errors: 0, Skipped: 0, Time elapsed: 1.441 sec - in org.apache.hadoop.yarn.server.nodemanager.util.TestCgroupsLCEResourcesHandler
Running org.apache.hadoop.yarn.server.nodemanager.util.TestNodeManagerHardwareUtils
Tests run: 3, Failures: 0, Errors: 0, Skipped: 0, Time elapsed: 0.905 sec - in org.apache.hadoop.yarn.server.nodemanager.util.TestNodeManagerHardwareUtils
Running org.apache.hadoop.yarn.server.nodemanager.util.TestProcessIdFileReader
Tests run: 3, Failures: 0, Errors: 0, Skipped: 0, Time elapsed: 0.219 sec - in org.apache.hadoop.yarn.server.nodemanager.util.TestProcessIdFileReader
Running org.apache.hadoop.yarn.server.nodemanager.amrmproxy.TestAMRMProxyService
Tests run: 16, Failures: 0, Errors: 0, Skipped: 0, Time elapsed: 2.223 sec - in org.apache.hadoop.yarn.server.nodemanager.amrmproxy.TestAMRMProxyService
Running org.apache.hadoop.yarn.server.nodemanager.TestDirectoryCollection
Tests run: 7, Failures: 0, Errors: 0, Skipped: 0, Time elapsed: 0.973 sec - in org.apache.hadoop.yarn.server.nodemanager.TestDirectoryCollection
Running org.apache.hadoop.yarn.server.nodemanager.TestLocalDirsHandlerService
Tests run: 3, Failures: 0, Errors: 0, Skipped: 0, Time elapsed: 1.085 sec - in org.apache.hadoop.yarn.server.nodemanager.TestLocalDirsHandlerService
Running org.apache.hadoop.yarn.server.nodemanager.TestEventFlow
Tests run: 1, Failures: 0, Errors: 0, Skipped: 0, Time elapsed: 5.971 sec - in org.apache.hadoop.yarn.server.nodemanager.TestEventFlow
Running org.apache.hadoop.yarn.server.nodemanager.recovery.TestNMLeveldbStateStoreService
Tests run: 12, Failures: 0, Errors: 0, Skipped: 0, Time elapsed: 2.11 sec - in org.apache.hadoop.yarn.server.nodemanager.recovery.TestNMLeveldbStateStoreService
Running org.apache.hadoop.yarn.server.nodemanager.TestContainerManagerWithLCE
Tests run: 16, Failures: 0, Errors: 0, Skipped: 0, Time elapsed: 2.162 sec - in org.apache.hadoop.yarn.server.nodemanager.TestContainerManagerWithLCE
Running org.apache.hadoop.yarn.server.nodemanager.TestRPCFactories
Tests run: 1, Failures: 0, Errors: 0, Skipped: 0, Time elapsed: 0.864 sec - in org.apache.hadoop.yarn.server.nodemanager.TestRPCFactories
Running org.apache.hadoop.yarn.server.nodemanager.TestNodeManagerReboot
Tests run: 1, Failures: 0, Errors: 0, Skipped: 0, Time elapsed: 7.681 sec - in org.apache.hadoop.yarn.server.nodemanager.TestNodeManagerReboot
Running org.apache.hadoop.yarn.server.nodemanager.TestLinuxContainerExecutor
Tests run: 8, Failures: 0, Errors: 0, Skipped: 8, Time elapsed: 1.186 sec - in org.apache.hadoop.yarn.server.nodemanager.TestLinuxContainerExecutor
Running org.apache.hadoop.yarn.server.nodemanager.TestRecordFactory
Tests run: 1, Failures: 0, Errors: 0, Skipped: 0, Time elapsed: 0.232 sec - in org.apache.hadoop.yarn.server.nodemanager.TestRecordFactory
Running org.apache.hadoop.yarn.server.nodemanager.webapp.TestNMWebServer
Tests run: 3, Failures: 0, Errors: 0, Skipped: 0, Time elapsed: 4.181 sec - in org.apache.hadoop.yarn.server.nodemanager.webapp.TestNMWebServer
Running org.apache.hadoop.yarn.server.nodemanager.webapp.TestContainerLogsPage
Tests run: 5, Failures: 0, Errors: 0, Skipped: 1, Time elapsed: 1.427 sec - in org.apache.hadoop.yarn.server.nodemanager.webapp.TestContainerLogsPage
Running org.apache.hadoop.yarn.server.nodemanager.webapp.TestNMWebServices
Tests run: 11, Failures: 0, Errors: 0, Skipped: 0, Time elapsed: 6.512 sec - in org.apache.hadoop.yarn.server.nodemanager.webapp.TestNMWebServices
Running org.apache.hadoop.yarn.server.nodemanager.webapp.TestNMWebServicesApps
Tests run: 19, Failures: 0, Errors: 0, Skipped: 0, Time elapsed: 8.462 sec - in org.apache.hadoop.yarn.server.nodemanager.webapp.TestNMWebServicesApps
Running org.apache.hadoop.yarn.server.nodemanager.webapp.TestNMWebServicesContainers
Tests run: 12, Failures: 0, Errors: 0, Skipped: 0, Time elapsed: 6.889 sec - in org.apache.hadoop.yarn.server.nodemanager.webapp.TestNMWebServicesContainers
Running org.apache.hadoop.yarn.server.nodemanager.TestNMAuditLogger
Tests run: 3, Failures: 0, Errors: 0, Skipped: 0, Time elapsed: 1.293 sec - in org.apache.hadoop.yarn.server.nodemanager.TestNMAuditLogger

Results :

Tests in error: 
  TestNodeStatusUpdater.testNodeStatusUpdaterRetryAndNMShutdown:1633 » UnsupportedFileSystem
  TestNodeStatusUpdater.tearDown:159 » ServiceState java.util.concurrent.Timeout...
  TestNodeStatusUpdater.deleteBaseDir:958 » UnsupportedFileSystem fs.AbstractFil...
  TestNodeStatusUpdater.testNMRegistration:1179 » Runtime java.lang.reflect.Invo...
  TestNodeStatusUpdater.deleteBaseDir:958 » UnsupportedFileSystem fs.AbstractFil...
  TestNodeStatusUpdater.testCompletedContainerStatusBackup:1594 » Runtime java.l...
  TestNodeStatusUpdater.deleteBaseDir:958 » UnsupportedFileSystem fs.AbstractFil...
  TestNodeStatusUpdater.testNodeDecommision:1295 » Runtime java.lang.reflect.Inv...
  TestNodeStatusUpdater.deleteBaseDir:958 » UnsupportedFileSystem fs.AbstractFil...
  TestNodeStatusUpdater.testRecentlyFinishedContainers:969 » Runtime java.lang.r...
  TestNodeStatusUpdater.deleteBaseDir:958 » UnsupportedFileSystem fs.AbstractFil...
  TestNodeStatusUpdater.deleteBaseDir:958 » UnsupportedFileSystem fs.AbstractFil...
  TestNodeStatusUpdater.testCompletedContainersIsRecentlyStopped:1084 » Runtime ...
  TestNodeStatusUpdater.deleteBaseDir:958 » UnsupportedFileSystem fs.AbstractFil...

Tests run: 435, Failures: 0, Errors: 14, Skipped: 17

[INFO] ------------------------------------------------------------------------
[INFO] Reactor Summary:
[INFO] 
[INFO] Apache Hadoop YARN ................................ SUCCESS [  3.889 s]
[INFO] Apache Hadoop YARN API ............................ SUCCESS [04:15 min]
[INFO] Apache Hadoop YARN Common ......................... SUCCESS [03:02 min]
[INFO] Apache Hadoop YARN Server ......................... SUCCESS [  0.093 s]
[INFO] Apache Hadoop YARN Server Common .................. SUCCESS [ 45.502 s]
[INFO] Apache Hadoop YARN NodeManager .................... FAILURE [09:05 min]
[INFO] Apache Hadoop YARN Web Proxy ...................... SKIPPED
[INFO] Apache Hadoop YARN ApplicationHistoryService ...... SKIPPED
[INFO] Apache Hadoop YARN ResourceManager ................ SKIPPED
[INFO] Apache Hadoop YARN Server Tests ................... SKIPPED
[INFO] Apache Hadoop YARN Client ......................... SKIPPED
[INFO] Apache Hadoop YARN SharedCacheManager ............. SKIPPED
[INFO] Apache Hadoop YARN Timeline Plugin Storage ........ SKIPPED
[INFO] Apache Hadoop YARN Applications ................... SKIPPED
[INFO] Apache Hadoop YARN DistributedShell ............... SKIPPED
[INFO] Apache Hadoop YARN Unmanaged Am Launcher .......... SKIPPED
[INFO] Apache Hadoop YARN Site ........................... SKIPPED
[INFO] Apache Hadoop YARN Registry ....................... SKIPPED
[INFO] Apache Hadoop YARN Project ........................ SKIPPED
[INFO] ------------------------------------------------------------------------
[INFO] BUILD FAILURE
[INFO] ------------------------------------------------------------------------
[INFO] Total time: 17:15 min
[INFO] Finished at: 2016-04-08T01:15:58+00:00
[INFO] Final Memory: 80M/894M
[INFO] ------------------------------------------------------------------------
[ERROR] Failed to execute goal org.apache.maven.plugins:maven-surefire-plugin:2.17:test (default-test)
on project hadoop-yarn-server-nodemanager: There are test failures.
[ERROR] 
[ERROR] Please refer to <https://builds.apache.org/job/Hadoop-Yarn-trunk/ws/hadoop-yarn-project/hadoop-yarn/hadoop-yarn-server/hadoop-yarn-server-nodemanager/target/surefire-reports>
for the individual test results.
[ERROR] -> [Help 1]
[ERROR] 
[ERROR] To see the full stack trace of the errors, re-run Maven with the -e switch.
[ERROR] Re-run Maven using the -X switch to enable full debug logging.
[ERROR] 
[ERROR] For more information about the errors and possible solutions, please read the following
articles:
[ERROR] [Help 1] http://cwiki.apache.org/confluence/display/MAVEN/MojoFailureException
[ERROR] 
[ERROR] After correcting the problems, you can resume the build with the command
[ERROR]   mvn <goals> -rf :hadoop-yarn-server-nodemanager
Build step 'Execute shell' marked build as failure
Archiving artifacts
Recording test results

Mime
View raw message