hadoop-yarn-dev mailing list archives

Site index · List index
Message view « Date » · « Thread »
Top « Date » · « Thread »
From Apache Jenkins Server <jenk...@builds.apache.org>
Subject Build failed in Jenkins: Hadoop-Yarn-trunk-Java8 #1346
Date Mon, 25 Apr 2016 13:38:27 GMT
See <https://builds.apache.org/job/Hadoop-Yarn-trunk-Java8/1346/changes>

Changes:

[aajisaka] HDFS-10298. Document the usage of distcp -diff option. Contributed by

------------------------------------------
[...truncated 3638 lines...]
[INFO] Apache Hadoop HDFS-NFS ............................ SUCCESS [  0.519 s]
[INFO] Apache Hadoop HDFS Project ........................ SUCCESS [  0.026 s]
[INFO] Apache Hadoop YARN ................................ SUCCESS [  0.024 s]
[INFO] Apache Hadoop YARN API ............................ SUCCESS [  5.896 s]
[INFO] Apache Hadoop YARN Common ......................... SUCCESS [  4.466 s]
[INFO] Apache Hadoop YARN Server ......................... SUCCESS [  0.022 s]
[INFO] Apache Hadoop YARN Server Common .................. SUCCESS [  1.336 s]
[INFO] Apache Hadoop YARN NodeManager .................... SUCCESS [  2.559 s]
[INFO] Apache Hadoop YARN Web Proxy ...................... SUCCESS [  0.371 s]
[INFO] Apache Hadoop YARN ApplicationHistoryService ...... SUCCESS [  0.986 s]
[INFO] Apache Hadoop YARN ResourceManager ................ SUCCESS [  5.673 s]
[INFO] Apache Hadoop YARN Server Tests ................... SUCCESS [  0.545 s]
[INFO] Apache Hadoop YARN Client ......................... SUCCESS [  0.997 s]
[INFO] Apache Hadoop YARN SharedCacheManager ............. SUCCESS [  0.333 s]
[INFO] Apache Hadoop YARN Timeline Plugin Storage ........ SUCCESS [  0.488 s]
[INFO] Apache Hadoop YARN Applications ................... SUCCESS [  0.026 s]
[INFO] Apache Hadoop YARN DistributedShell ............... SUCCESS [  0.407 s]
[INFO] Apache Hadoop YARN Unmanaged Am Launcher .......... SUCCESS [  0.203 s]
[INFO] Apache Hadoop YARN Site ........................... SUCCESS [  0.029 s]
[INFO] Apache Hadoop YARN Registry ....................... SUCCESS [  0.501 s]
[INFO] Apache Hadoop YARN Project ........................ SUCCESS [  0.054 s]
[INFO] Apache Hadoop MapReduce Client .................... SUCCESS [  0.050 s]
[INFO] Apache Hadoop MapReduce Core ...................... SUCCESS [  2.893 s]
[INFO] Apache Hadoop MapReduce Common .................... SUCCESS [  1.981 s]
[INFO] Apache Hadoop MapReduce Shuffle ................... SUCCESS [  0.450 s]
[INFO] Apache Hadoop MapReduce App ....................... SUCCESS [  2.007 s]
[INFO] Apache Hadoop MapReduce HistoryServer ............. SUCCESS [  0.877 s]
[INFO] Apache Hadoop MapReduce JobClient ................. SUCCESS [  2.534 s]
[INFO] Apache Hadoop MapReduce HistoryServer Plugins ..... SUCCESS [  0.158 s]
[INFO] Apache Hadoop MapReduce NativeTask ................ SUCCESS [  0.379 s]
[INFO] Apache Hadoop MapReduce Examples .................. SUCCESS [  0.717 s]
[INFO] Apache Hadoop MapReduce ........................... SUCCESS [  0.063 s]
[INFO] Apache Hadoop MapReduce Streaming ................. SUCCESS [  0.815 s]
[INFO] Apache Hadoop Distributed Copy .................... SUCCESS [  0.882 s]
[INFO] Apache Hadoop Archives ............................ SUCCESS [  0.267 s]
[INFO] Apache Hadoop Archive Logs ........................ SUCCESS [  0.393 s]
[INFO] Apache Hadoop Rumen ............................... SUCCESS [  0.566 s]
[INFO] Apache Hadoop Gridmix ............................. SUCCESS [  0.693 s]
[INFO] Apache Hadoop Data Join ........................... SUCCESS [  0.231 s]
[INFO] Apache Hadoop Ant Tasks ........................... SUCCESS [  0.147 s]
[INFO] Apache Hadoop Extras .............................. SUCCESS [  0.250 s]
[INFO] Apache Hadoop Pipes ............................... SUCCESS [  0.018 s]
[INFO] Apache Hadoop OpenStack support ................... SUCCESS [  0.262 s]
[INFO] Apache Hadoop Amazon Web Services support ......... SUCCESS [  0.325 s]
[INFO] Apache Hadoop Azure support ....................... SUCCESS [  0.764 s]
[INFO] Apache Hadoop Client .............................. SUCCESS [  1.013 s]
[INFO] Apache Hadoop Mini-Cluster ........................ SUCCESS [  0.097 s]
[INFO] Apache Hadoop Scheduler Load Simulator ............ SUCCESS [  0.863 s]
[INFO] Apache Hadoop Tools Dist .......................... SUCCESS [  0.185 s]
[INFO] Apache Hadoop Kafka Library support ............... SUCCESS [  0.136 s]
[INFO] Apache Hadoop Tools ............................... SUCCESS [  0.025 s]
[INFO] Apache Hadoop Distribution ........................ SUCCESS [  0.051 s]
[INFO] ------------------------------------------------------------------------
[INFO] BUILD SUCCESS
[INFO] ------------------------------------------------------------------------
[INFO] Total time: 02:04 min
[INFO] Finished at: 2016-04-25T13:37:57+00:00
[INFO] Final Memory: 258M/1041M
[INFO] ------------------------------------------------------------------------
+ cd hadoop-yarn-project
+ /home/jenkins/tools/maven/latest/bin/mvn clean verify checkstyle:checkstyle findbugs:findbugs
-Pdist -Pnative -Dtar -Dmaven.javadoc.skip=true
Java HotSpot(TM) 64-Bit Server VM warning: ignoring option MaxPermSize=768m; support was removed
in 8.0
[INFO] Scanning for projects...
[INFO] ------------------------------------------------------------------------
[INFO] Reactor Build Order:
[INFO] 
[INFO] Apache Hadoop YARN
[INFO] Apache Hadoop YARN API
[INFO] Apache Hadoop YARN Common
[INFO] Apache Hadoop YARN Server
[INFO] Apache Hadoop YARN Server Common
[INFO] Apache Hadoop YARN NodeManager
[INFO] Apache Hadoop YARN Web Proxy
[INFO] Apache Hadoop YARN ApplicationHistoryService
[INFO] Apache Hadoop YARN ResourceManager
[INFO] Apache Hadoop YARN Server Tests
[INFO] Apache Hadoop YARN Client
[INFO] Apache Hadoop YARN SharedCacheManager
[INFO] Apache Hadoop YARN Timeline Plugin Storage
[INFO] Apache Hadoop YARN Applications
[INFO] Apache Hadoop YARN DistributedShell
[INFO] Apache Hadoop YARN Unmanaged Am Launcher
[INFO] Apache Hadoop YARN Site
[INFO] Apache Hadoop YARN Registry
[INFO] Apache Hadoop YARN Project
[INFO] 
[INFO] Using the builder org.apache.maven.lifecycle.internal.builder.singlethreaded.SingleThreadedBuilder
with a thread count of 1
[INFO]                                                                         
[INFO] ------------------------------------------------------------------------
[INFO] Building Apache Hadoop YARN 3.0.0-SNAPSHOT
[INFO] ------------------------------------------------------------------------
[INFO] 
[INFO] --- maven-clean-plugin:2.5:clean (default-clean) @ hadoop-yarn ---
[INFO] Deleting <https://builds.apache.org/job/Hadoop-Yarn-trunk-Java8/ws/hadoop-yarn-project/hadoop-yarn/target>
[INFO] 
[INFO] --- maven-antrun-plugin:1.7:run (create-testdirs) @ hadoop-yarn ---
[INFO] Executing tasks

main:
    [mkdir] Created dir: <https://builds.apache.org/job/Hadoop-Yarn-trunk-Java8/ws/hadoop-yarn-project/hadoop-yarn/target/test-dir>
[INFO] Executed tasks
[INFO] 
[INFO] --- maven-source-plugin:2.3:jar-no-fork (hadoop-java-sources) @ hadoop-yarn ---
[INFO] 
[INFO] --- maven-source-plugin:2.3:test-jar-no-fork (hadoop-java-sources) @ hadoop-yarn ---
[INFO] 
[INFO] --- maven-enforcer-plugin:1.3.1:enforce (dist-enforce) @ hadoop-yarn ---
[INFO] 
[INFO] --- maven-site-plugin:3.5:attach-descriptor (attach-descriptor) @ hadoop-yarn ---
[INFO] 
[INFO] --- maven-javadoc-plugin:2.8.1:jar (module-javadocs) @ hadoop-yarn ---
[INFO] Skipping javadoc generation
[INFO] 
[INFO] --- maven-enforcer-plugin:1.3.1:enforce (depcheck) @ hadoop-yarn ---
[INFO] 
[INFO] --- maven-checkstyle-plugin:2.15:checkstyle (default-cli) @ hadoop-yarn ---
[INFO] 
[INFO] --- findbugs-maven-plugin:3.0.0:findbugs (default-cli) @ hadoop-yarn ---
[INFO]                                                                         
[INFO] ------------------------------------------------------------------------
[INFO] Building Apache Hadoop YARN API 3.0.0-SNAPSHOT
[INFO] ------------------------------------------------------------------------
[INFO] 
[INFO] --- maven-clean-plugin:2.5:clean (default-clean) @ hadoop-yarn-api ---
[INFO] Deleting <https://builds.apache.org/job/Hadoop-Yarn-trunk-Java8/ws/hadoop-yarn-project/hadoop-yarn/hadoop-yarn-api/target>
[INFO] 
[INFO] --- maven-antrun-plugin:1.7:run (create-testdirs) @ hadoop-yarn-api ---
[INFO] Executing tasks

main:
    [mkdir] Created dir: <https://builds.apache.org/job/Hadoop-Yarn-trunk-Java8/ws/hadoop-yarn-project/hadoop-yarn/hadoop-yarn-api/target/test-dir>
[INFO] Executed tasks
[INFO] 
[INFO] --- hadoop-maven-plugins:3.0.0-SNAPSHOT:protoc (compile-protoc) @ hadoop-yarn-api ---
[INFO] Wrote protoc checksums to file <https://builds.apache.org/job/Hadoop-Yarn-trunk-Java8/ws/hadoop-yarn-project/hadoop-yarn/hadoop-yarn-api/target/hadoop-maven-plugins-protoc-checksums.json>
[INFO] 
[INFO] --- maven-resources-plugin:2.6:resources (default-resources) @ hadoop-yarn-api ---
[INFO] Using 'UTF-8' encoding to copy filtered resources.
[INFO] Copying 1 resource
[INFO] 
[INFO] --- maven-compiler-plugin:3.1:compile (default-compile) @ hadoop-yarn-api ---
[INFO] Compiling 236 source files to <https://builds.apache.org/job/Hadoop-Yarn-trunk-Java8/ws/hadoop-yarn-project/hadoop-yarn/hadoop-yarn-api/target/classes>
[INFO] 
[INFO] --- maven-resources-plugin:2.6:testResources (default-testResources) @ hadoop-yarn-api
---
[INFO] Using 'UTF-8' encoding to copy filtered resources.
[INFO] skip non existing resourceDirectory <https://builds.apache.org/job/Hadoop-Yarn-trunk-Java8/ws/hadoop-yarn-project/hadoop-yarn/hadoop-yarn-api/src/test/resources>
[INFO] 
[INFO] --- maven-compiler-plugin:3.1:testCompile (default-testCompile) @ hadoop-yarn-api ---
[INFO] Compiling 1 source file to <https://builds.apache.org/job/Hadoop-Yarn-trunk-Java8/ws/hadoop-yarn-project/hadoop-yarn/hadoop-yarn-api/target/test-classes>
[INFO] 
[INFO] --- maven-jar-plugin:2.5:test-jar (default) @ hadoop-yarn-api ---
[INFO] Building jar: <https://builds.apache.org/job/Hadoop-Yarn-trunk-Java8/ws/hadoop-yarn-project/hadoop-yarn/hadoop-yarn-api/target/hadoop-yarn-api-3.0.0-SNAPSHOT-tests.jar>
[INFO] 
[INFO] --- maven-surefire-plugin:2.17:test (default-test) @ hadoop-yarn-api ---
[INFO] Surefire report directory: <https://builds.apache.org/job/Hadoop-Yarn-trunk-Java8/ws/hadoop-yarn-project/hadoop-yarn/hadoop-yarn-api/target/surefire-reports>

-------------------------------------------------------
 T E S T S
-------------------------------------------------------

-------------------------------------------------------
 T E S T S
-------------------------------------------------------
Java HotSpot(TM) 64-Bit Server VM warning: ignoring option MaxPermSize=768m; support was removed
in 8.0
Running org.apache.hadoop.yarn.conf.TestYarnConfigurationFields
Tests run: 2, Failures: 1, Errors: 0, Skipped: 0, Time elapsed: 0.383 sec <<< FAILURE!
- in org.apache.hadoop.yarn.conf.TestYarnConfigurationFields
testCompareConfigurationClassAgainstXml(org.apache.hadoop.yarn.conf.TestYarnConfigurationFields)
 Time elapsed: 0.045 sec  <<< FAILURE!
java.lang.AssertionError: class org.apache.hadoop.yarn.conf.YarnConfiguration has 8 variables
missing in yarn-default.xml
	at org.junit.Assert.fail(Assert.java:88)
	at org.junit.Assert.assertTrue(Assert.java:41)
	at org.apache.hadoop.conf.TestConfigurationFieldsBase.testCompareConfigurationClassAgainstXml(TestConfigurationFieldsBase.java:425)
	at sun.reflect.NativeMethodAccessorImpl.invoke0(Native Method)
	at sun.reflect.NativeMethodAccessorImpl.invoke(NativeMethodAccessorImpl.java:62)
	at sun.reflect.DelegatingMethodAccessorImpl.invoke(DelegatingMethodAccessorImpl.java:43)
	at java.lang.reflect.Method.invoke(Method.java:483)
	at org.junit.runners.model.FrameworkMethod$1.runReflectiveCall(FrameworkMethod.java:47)
	at org.junit.internal.runners.model.ReflectiveCallable.run(ReflectiveCallable.java:12)
	at org.junit.runners.model.FrameworkMethod.invokeExplosively(FrameworkMethod.java:44)
	at org.junit.internal.runners.statements.InvokeMethod.evaluate(InvokeMethod.java:17)
	at org.junit.internal.runners.statements.RunBefores.evaluate(RunBefores.java:26)
	at org.junit.runners.ParentRunner.runLeaf(ParentRunner.java:271)
	at org.junit.runners.BlockJUnit4ClassRunner.runChild(BlockJUnit4ClassRunner.java:70)
	at org.junit.runners.BlockJUnit4ClassRunner.runChild(BlockJUnit4ClassRunner.java:50)
	at org.junit.runners.ParentRunner$3.run(ParentRunner.java:238)
	at org.junit.runners.ParentRunner$1.schedule(ParentRunner.java:63)
	at org.junit.runners.ParentRunner.runChildren(ParentRunner.java:236)
	at org.junit.runners.ParentRunner.access$000(ParentRunner.java:53)
	at org.junit.runners.ParentRunner$2.evaluate(ParentRunner.java:229)
	at org.junit.runners.ParentRunner.run(ParentRunner.java:309)
	at org.apache.maven.surefire.junit4.JUnit4Provider.execute(JUnit4Provider.java:264)
	at org.apache.maven.surefire.junit4.JUnit4Provider.executeTestSet(JUnit4Provider.java:153)
	at org.apache.maven.surefire.junit4.JUnit4Provider.invoke(JUnit4Provider.java:124)
	at org.apache.maven.surefire.booter.ForkedBooter.invokeProviderInSameClassLoader(ForkedBooter.java:200)
	at org.apache.maven.surefire.booter.ForkedBooter.runSuitesInProcess(ForkedBooter.java:153)
	at org.apache.maven.surefire.booter.ForkedBooter.main(ForkedBooter.java:103)


Results :

Failed tests: 
  TestYarnConfigurationFields>TestConfigurationFieldsBase.testCompareConfigurationClassAgainstXml:425
class org.apache.hadoop.yarn.conf.YarnConfiguration has 8 variables missing in yarn-default.xml

Tests run: 2, Failures: 1, Errors: 0, Skipped: 0

[INFO] ------------------------------------------------------------------------
[INFO] Reactor Summary:
[INFO] 
[INFO] Apache Hadoop YARN ................................ SUCCESS [  3.044 s]
[INFO] Apache Hadoop YARN API ............................ FAILURE [ 12.940 s]
[INFO] Apache Hadoop YARN Common ......................... SKIPPED
[INFO] Apache Hadoop YARN Server ......................... SKIPPED
[INFO] Apache Hadoop YARN Server Common .................. SKIPPED
[INFO] Apache Hadoop YARN NodeManager .................... SKIPPED
[INFO] Apache Hadoop YARN Web Proxy ...................... SKIPPED
[INFO] Apache Hadoop YARN ApplicationHistoryService ...... SKIPPED
[INFO] Apache Hadoop YARN ResourceManager ................ SKIPPED
[INFO] Apache Hadoop YARN Server Tests ................... SKIPPED
[INFO] Apache Hadoop YARN Client ......................... SKIPPED
[INFO] Apache Hadoop YARN SharedCacheManager ............. SKIPPED
[INFO] Apache Hadoop YARN Timeline Plugin Storage ........ SKIPPED
[INFO] Apache Hadoop YARN Applications ................... SKIPPED
[INFO] Apache Hadoop YARN DistributedShell ............... SKIPPED
[INFO] Apache Hadoop YARN Unmanaged Am Launcher .......... SKIPPED
[INFO] Apache Hadoop YARN Site ........................... SKIPPED
[INFO] Apache Hadoop YARN Registry ....................... SKIPPED
[INFO] Apache Hadoop YARN Project ........................ SKIPPED
[INFO] ------------------------------------------------------------------------
[INFO] BUILD FAILURE
[INFO] ------------------------------------------------------------------------
[INFO] Total time: 17.124 s
[INFO] Finished at: 2016-04-25T13:38:17+00:00
[INFO] Final Memory: 52M/283M
[INFO] ------------------------------------------------------------------------
[ERROR] Failed to execute goal org.apache.maven.plugins:maven-surefire-plugin:2.17:test (default-test)
on project hadoop-yarn-api: There are test failures.
[ERROR] 
[ERROR] Please refer to <https://builds.apache.org/job/Hadoop-Yarn-trunk-Java8/ws/hadoop-yarn-project/hadoop-yarn/hadoop-yarn-api/target/surefire-reports>
for the individual test results.
[ERROR] -> [Help 1]
[ERROR] 
[ERROR] To see the full stack trace of the errors, re-run Maven with the -e switch.
[ERROR] Re-run Maven using the -X switch to enable full debug logging.
[ERROR] 
[ERROR] For more information about the errors and possible solutions, please read the following
articles:
[ERROR] [Help 1] http://cwiki.apache.org/confluence/display/MAVEN/MojoFailureException
[ERROR] 
[ERROR] After correcting the problems, you can resume the build with the command
[ERROR]   mvn <goals> -rf :hadoop-yarn-api
Build step 'Execute shell' marked build as failure
Archiving artifacts
Recording test results

Mime
View raw message