hadoop-yarn-dev mailing list archives

Site index · List index
Message view « Date » · « Thread »
Top « Date » · « Thread »
From Apache Jenkins Server <jenk...@builds.apache.org>
Subject Hadoop-Yarn-trunk - Build # 2028 - Still Failing
Date Sun, 17 Apr 2016 08:10:42 GMT
See https://builds.apache.org/job/Hadoop-Yarn-trunk/2028/

###################################################################################
########################## LAST 60 LINES OF THE CONSOLE ###########################
[...truncated 9589 lines...]

Results :

Failed tests: 
  TestRMApplicationHistoryWriter.testRMWritingMassiveHistoryForCapacitySche:383->testRMWritingMassiveHistory:431->testRMWritingMassiveHistory:470
expected:<10000> but was:<9936>
  TestCapacityScheduler.testQueueHierarchyPendingResourceUpdate:2836->checkPendingResource:2846
expected:<0> but was:<8192>

Tests in error: 
  TestSchedulingPolicy.testIsApplicableTo:116 »  test timed out after 1000 milli...
  TestEmptyQueues.testFifoPolicy:44 »  test timed out after 1000 milliseconds
  TestAMRestart.testAMRestartNotLostContainerCompleteMsg:948 »  test timed out a...

Tests run: 1349, Failures: 2, Errors: 3, Skipped: 3

[INFO] ------------------------------------------------------------------------
[INFO] Reactor Summary:
[INFO] 
[INFO] Apache Hadoop YARN ................................ SUCCESS [  5.544 s]
[INFO] Apache Hadoop YARN API ............................ SUCCESS [06:51 min]
[INFO] Apache Hadoop YARN Common ......................... SUCCESS [05:07 min]
[INFO] Apache Hadoop YARN Server ......................... SUCCESS [  0.135 s]
[INFO] Apache Hadoop YARN Server Common .................. SUCCESS [01:25 min]
[INFO] Apache Hadoop YARN NodeManager .................... SUCCESS [13:09 min]
[INFO] Apache Hadoop YARN Web Proxy ...................... SUCCESS [ 48.145 s]
[INFO] Apache Hadoop YARN ApplicationHistoryService ...... SUCCESS [05:06 min]
[INFO] Apache Hadoop YARN ResourceManager ................ FAILURE [  01:38 h]
[INFO] Apache Hadoop YARN Server Tests ................... SKIPPED
[INFO] Apache Hadoop YARN Client ......................... SKIPPED
[INFO] Apache Hadoop YARN SharedCacheManager ............. SKIPPED
[INFO] Apache Hadoop YARN Timeline Plugin Storage ........ SKIPPED
[INFO] Apache Hadoop YARN Applications ................... SKIPPED
[INFO] Apache Hadoop YARN DistributedShell ............... SKIPPED
[INFO] Apache Hadoop YARN Unmanaged Am Launcher .......... SKIPPED
[INFO] Apache Hadoop YARN Site ........................... SKIPPED
[INFO] Apache Hadoop YARN Registry ....................... SKIPPED
[INFO] Apache Hadoop YARN Project ........................ SKIPPED
[INFO] ------------------------------------------------------------------------
[INFO] BUILD FAILURE
[INFO] ------------------------------------------------------------------------
[INFO] Total time: 02:10 h
[INFO] Finished at: 2016-04-17T08:10:32+00:00
[INFO] Final Memory: 64M/566M
[INFO] ------------------------------------------------------------------------
[ERROR] Failed to execute goal org.apache.maven.plugins:maven-surefire-plugin:2.17:test (default-test)
on project hadoop-yarn-server-resourcemanager: There was a timeout or other error in the fork
-> [Help 1]
[ERROR] 
[ERROR] To see the full stack trace of the errors, re-run Maven with the -e switch.
[ERROR] Re-run Maven using the -X switch to enable full debug logging.
[ERROR] 
[ERROR] For more information about the errors and possible solutions, please read the following
articles:
[ERROR] [Help 1] http://cwiki.apache.org/confluence/display/MAVEN/MojoFailureException
[ERROR] 
[ERROR] After correcting the problems, you can resume the build with the command
[ERROR]   mvn <goals> -rf :hadoop-yarn-server-resourcemanager
Build step 'Execute shell' marked build as failure
Archiving artifacts
Recording test results
Sending e-mails to: yarn-dev@hadoop.apache.org
Email was triggered for: Failure - Any
Sending email for trigger: Failure - Any



###################################################################################
############################## FAILED TESTS (if any) ##############################
5 tests failed.
FAILED:  org.apache.hadoop.yarn.server.resourcemanager.ahs.TestRMApplicationHistoryWriter.testRMWritingMassiveHistoryForCapacitySche

Error Message:
expected:<10000> but was:<9936>

Stack Trace:
java.lang.AssertionError: expected:<10000> but was:<9936>
	at org.junit.Assert.fail(Assert.java:88)
	at org.junit.Assert.failNotEquals(Assert.java:743)
	at org.junit.Assert.assertEquals(Assert.java:118)
	at org.junit.Assert.assertEquals(Assert.java:555)
	at org.junit.Assert.assertEquals(Assert.java:542)
	at org.apache.hadoop.yarn.server.resourcemanager.ahs.TestRMApplicationHistoryWriter.testRMWritingMassiveHistory(TestRMApplicationHistoryWriter.java:470)
	at org.apache.hadoop.yarn.server.resourcemanager.ahs.TestRMApplicationHistoryWriter.testRMWritingMassiveHistory(TestRMApplicationHistoryWriter.java:431)
	at org.apache.hadoop.yarn.server.resourcemanager.ahs.TestRMApplicationHistoryWriter.testRMWritingMassiveHistoryForCapacitySche(TestRMApplicationHistoryWriter.java:383)


FAILED:  org.apache.hadoop.yarn.server.resourcemanager.scheduler.capacity.TestCapacityScheduler.testQueueHierarchyPendingResourceUpdate

Error Message:
expected:<0> but was:<8192>

Stack Trace:
java.lang.AssertionError: expected:<0> but was:<8192>
	at org.junit.Assert.fail(Assert.java:88)
	at org.junit.Assert.failNotEquals(Assert.java:743)
	at org.junit.Assert.assertEquals(Assert.java:118)
	at org.junit.Assert.assertEquals(Assert.java:555)
	at org.junit.Assert.assertEquals(Assert.java:542)
	at org.apache.hadoop.yarn.server.resourcemanager.scheduler.capacity.TestCapacityScheduler.checkPendingResource(TestCapacityScheduler.java:2846)
	at org.apache.hadoop.yarn.server.resourcemanager.scheduler.capacity.TestCapacityScheduler.testQueueHierarchyPendingResourceUpdate(TestCapacityScheduler.java:2836)


FAILED:  org.apache.hadoop.yarn.server.resourcemanager.scheduler.fair.policies.TestEmptyQueues.testFifoPolicy

Error Message:
test timed out after 1000 milliseconds

Stack Trace:
java.lang.Exception: test timed out after 1000 milliseconds
	at sun.misc.Unsafe.getObject(Native Method)
	at java.util.concurrent.ConcurrentHashMap.putIfAbsent(ConcurrentHashMap.java:1147)
	at java.lang.ClassLoader.checkCerts(ClassLoader.java:948)
	at java.lang.ClassLoader.preDefineClass(ClassLoader.java:666)
	at java.lang.ClassLoader.defineClass(ClassLoader.java:794)
	at java.security.SecureClassLoader.defineClass(SecureClassLoader.java:142)
	at java.net.URLClassLoader.defineClass(URLClassLoader.java:449)
	at java.net.URLClassLoader.access$100(URLClassLoader.java:71)
	at java.net.URLClassLoader$1.run(URLClassLoader.java:361)
	at java.net.URLClassLoader$1.run(URLClassLoader.java:355)
	at java.security.AccessController.doPrivileged(Native Method)
	at java.net.URLClassLoader.findClass(URLClassLoader.java:354)
	at java.lang.ClassLoader.loadClass(ClassLoader.java:425)
	at sun.misc.Launcher$AppClassLoader.loadClass(Launcher.java:308)
	at java.lang.ClassLoader.loadClass(ClassLoader.java:358)
	at org.apache.hadoop.yarn.proto.YarnProtos$ResourceProto.newBuilder(YarnProtos.java:5080)
	at org.apache.hadoop.yarn.api.records.impl.pb.ResourcePBImpl.<init>(ResourcePBImpl.java:36)
	at sun.reflect.NativeConstructorAccessorImpl.newInstance0(Native Method)
	at sun.reflect.NativeConstructorAccessorImpl.newInstance(NativeConstructorAccessorImpl.java:57)
	at sun.reflect.DelegatingConstructorAccessorImpl.newInstance(DelegatingConstructorAccessorImpl.java:45)
	at java.lang.reflect.Constructor.newInstance(Constructor.java:526)
	at org.apache.hadoop.yarn.factories.impl.pb.RecordFactoryPBImpl.newRecordInstance(RecordFactoryPBImpl.java:70)
	at org.apache.hadoop.yarn.util.Records.newRecord(Records.java:36)
	at org.apache.hadoop.yarn.util.resource.Resources.createResource(Resources.java:102)
	at org.apache.hadoop.yarn.util.resource.Resources.createResource(Resources.java:98)
	at org.apache.hadoop.yarn.server.resourcemanager.scheduler.fair.policies.FairSharePolicy$FairShareComparator.<clinit>(FairSharePolicy.java:71)
	at org.apache.hadoop.yarn.server.resourcemanager.scheduler.fair.policies.FairSharePolicy.<clinit>(FairSharePolicy.java:47)
	at sun.reflect.NativeConstructorAccessorImpl.newInstance0(Native Method)
	at sun.reflect.NativeConstructorAccessorImpl.newInstance(NativeConstructorAccessorImpl.java:57)
	at sun.reflect.DelegatingConstructorAccessorImpl.newInstance(DelegatingConstructorAccessorImpl.java:45)
	at java.lang.reflect.Constructor.newInstance(Constructor.java:526)
	at org.apache.hadoop.util.ReflectionUtils.newInstance(ReflectionUtils.java:132)
	at org.apache.hadoop.yarn.server.resourcemanager.scheduler.fair.SchedulingPolicy.getInstance(SchedulingPolicy.java:55)
	at org.apache.hadoop.yarn.server.resourcemanager.scheduler.fair.SchedulingPolicy.<clinit>(SchedulingPolicy.java:42)
	at org.apache.hadoop.yarn.server.resourcemanager.scheduler.fair.policies.TestEmptyQueues.testFifoPolicy(TestEmptyQueues.java:44)


FAILED:  org.apache.hadoop.yarn.server.resourcemanager.scheduler.fair.TestSchedulingPolicy.testIsApplicableTo

Error Message:
test timed out after 1000 milliseconds

Stack Trace:
java.lang.Exception: test timed out after 1000 milliseconds
	at java.net.URLStreamHandler.parseURL(URLStreamHandler.java:138)
	at sun.net.www.protocol.file.Handler.parseURL(Handler.java:67)
	at java.net.URL.<init>(URL.java:614)
	at java.net.URL.<init>(URL.java:482)
	at sun.misc.URLClassPath$FileLoader.getResource(URLClassPath.java:1057)
	at sun.misc.URLClassPath.getResource(URLClassPath.java:199)
	at java.net.URLClassLoader$1.run(URLClassLoader.java:358)
	at java.net.URLClassLoader$1.run(URLClassLoader.java:355)
	at java.security.AccessController.doPrivileged(Native Method)
	at java.net.URLClassLoader.findClass(URLClassLoader.java:354)
	at java.lang.ClassLoader.loadClass(ClassLoader.java:425)
	at sun.misc.Launcher$AppClassLoader.loadClass(Launcher.java:308)
	at java.lang.ClassLoader.loadClass(ClassLoader.java:358)
	at org.apache.hadoop.yarn.server.resourcemanager.scheduler.fair.TestSchedulingPolicy.testIsApplicableTo(TestSchedulingPolicy.java:116)


FAILED:  org.apache.hadoop.yarn.server.resourcemanager.applicationsmanager.TestAMRestart.testAMRestartNotLostContainerCompleteMsg

Error Message:
test timed out after 30000 milliseconds

Stack Trace:
java.lang.Exception: test timed out after 30000 milliseconds
	at java.lang.Thread.sleep(Native Method)
	at org.apache.hadoop.yarn.server.resourcemanager.MockRM.waitForState(MockRM.java:314)
	at org.apache.hadoop.yarn.server.resourcemanager.MockRM.waitForState(MockRM.java:299)
	at org.apache.hadoop.yarn.server.resourcemanager.MockRM.waitForState(MockRM.java:294)
	at org.apache.hadoop.yarn.server.resourcemanager.applicationsmanager.TestAMRestart.testAMRestartNotLostContainerCompleteMsg(TestAMRestart.java:948)



Mime
  • Unnamed multipart/mixed (inline, None, 0 bytes)
View raw message