hadoop-yarn-dev mailing list archives

Site index · List index
Message view « Date » · « Thread »
Top « Date » · « Thread »
From Apache Jenkins Server <jenk...@builds.apache.org>
Subject Hadoop-Yarn-trunk-Java8 - Build # 1249 - Still Failing
Date Sat, 02 Apr 2016 00:28:11 GMT
See https://builds.apache.org/job/Hadoop-Yarn-trunk-Java8/1249/

###################################################################################
########################## LAST 60 LINES OF THE CONSOLE ###########################
[...truncated 5339 lines...]

Results :

Failed tests: 
  TestRMAdminService.testResourcePersistentForNMRegistrationWithNewResource:287 expected:<<memory:[4096,
vCores:4]>> but was:<<memory:[5120, vCores:5]>>

Tests in error: 
  TestRMApplicationHistoryWriter.testRMWritingMassiveHistoryForFairSche:377->testRMWritingMassiveHistory:431->testRMWritingMassiveHistory:452
» ServiceConfiguration
  TestRMApplicationHistoryWriter.testRMWritingMassiveHistoryForCapacitySche:383->testRMWritingMassiveHistory:399
» ClassCast

Tests run: 1353, Failures: 1, Errors: 2, Skipped: 3

[INFO] ------------------------------------------------------------------------
[INFO] Reactor Summary:
[INFO] 
[INFO] Apache Hadoop YARN ................................ SUCCESS [ 11.539 s]
[INFO] Apache Hadoop YARN API ............................ SUCCESS [03:21 min]
[INFO] Apache Hadoop YARN Common ......................... SUCCESS [03:41 min]
[INFO] Apache Hadoop YARN Server ......................... SUCCESS [  0.168 s]
[INFO] Apache Hadoop YARN Server Common .................. SUCCESS [ 52.367 s]
[INFO] Apache Hadoop YARN NodeManager .................... SUCCESS [11:46 min]
[INFO] Apache Hadoop YARN Web Proxy ...................... SUCCESS [ 28.241 s]
[INFO] Apache Hadoop YARN ApplicationHistoryService ...... SUCCESS [05:02 min]
[INFO] Apache Hadoop YARN ResourceManager ................ FAILURE [  01:08 h]
[INFO] Apache Hadoop YARN Server Tests ................... SKIPPED
[INFO] Apache Hadoop YARN Client ......................... SKIPPED
[INFO] Apache Hadoop YARN SharedCacheManager ............. SKIPPED
[INFO] Apache Hadoop YARN Timeline Plugin Storage ........ SKIPPED
[INFO] Apache Hadoop YARN Applications ................... SKIPPED
[INFO] Apache Hadoop YARN DistributedShell ............... SKIPPED
[INFO] Apache Hadoop YARN Unmanaged Am Launcher .......... SKIPPED
[INFO] Apache Hadoop YARN Site ........................... SKIPPED
[INFO] Apache Hadoop YARN Registry ....................... SKIPPED
[INFO] Apache Hadoop YARN Project ........................ SKIPPED
[INFO] ------------------------------------------------------------------------
[INFO] BUILD FAILURE
[INFO] ------------------------------------------------------------------------
[INFO] Total time: 01:33 h
[INFO] Finished at: 2016-04-02T00:28:11+00:00
[INFO] Final Memory: 65M/1182M
[INFO] ------------------------------------------------------------------------
[ERROR] Failed to execute goal org.apache.maven.plugins:maven-surefire-plugin:2.17:test (default-test)
on project hadoop-yarn-server-resourcemanager: ExecutionException: java.lang.RuntimeException:
The forked VM terminated without properly saying goodbye. VM crash or System.exit called?
[ERROR] Command was /bin/sh -c cd /home/jenkins/jenkins-slave/workspace/Hadoop-Yarn-trunk-Java8/hadoop-yarn-project/hadoop-yarn/hadoop-yarn-server/hadoop-yarn-server-resourcemanager
&& /home/jenkins/tools/java/jdk1.8.0/jre/bin/java -Xmx2048m -XX:MaxPermSize=768m -XX:+HeapDumpOnOutOfMemoryError
-jar /home/jenkins/jenkins-slave/workspace/Hadoop-Yarn-trunk-Java8/hadoop-yarn-project/hadoop-yarn/hadoop-yarn-server/hadoop-yarn-server-resourcemanager/target/surefire/surefirebooter2013060583549956089.jar
/home/jenkins/jenkins-slave/workspace/Hadoop-Yarn-trunk-Java8/hadoop-yarn-project/hadoop-yarn/hadoop-yarn-server/hadoop-yarn-server-resourcemanager/target/surefire/surefire4150495691084865886tmp
/home/jenkins/jenkins-slave/workspace/Hadoop-Yarn-trunk-Java8/hadoop-yarn-project/hadoop-yarn/hadoop-yarn-server/hadoop-yarn-server-resourcemanager/target/surefire/surefire_2521074888932426643797tmp
[ERROR] -> [Help 1]
[ERROR] 
[ERROR] To see the full stack trace of the errors, re-run Maven with the -e switch.
[ERROR] Re-run Maven using the -X switch to enable full debug logging.
[ERROR] 
[ERROR] For more information about the errors and possible solutions, please read the following
articles:
[ERROR] [Help 1] http://cwiki.apache.org/confluence/display/MAVEN/MojoFailureException
[ERROR] 
[ERROR] After correcting the problems, you can resume the build with the command
[ERROR]   mvn <goals> -rf :hadoop-yarn-server-resourcemanager
Build step 'Execute shell' marked build as failure
Archiving artifacts
Recording test results
Sending e-mails to: yarn-dev@hadoop.apache.org
Email was triggered for: Failure - Any
Sending email for trigger: Failure - Any



###################################################################################
############################## FAILED TESTS (if any) ##############################
3 tests failed.
FAILED:  org.apache.hadoop.yarn.server.resourcemanager.ahs.TestRMApplicationHistoryWriter.testRMWritingMassiveHistoryForFairSche

Error Message:
org.apache.hadoop.security.token.TokenIdentifier: Provider org.apache.hadoop.hdfs.security.token.block.BlockTokenIdentifier
not found

Stack Trace:
java.util.ServiceConfigurationError: org.apache.hadoop.security.token.TokenIdentifier: Provider
org.apache.hadoop.hdfs.security.token.block.BlockTokenIdentifier not found
	at java.util.ServiceLoader.fail(ServiceLoader.java:239)
	at java.util.ServiceLoader.access$300(ServiceLoader.java:185)
	at java.util.ServiceLoader$LazyIterator.nextService(ServiceLoader.java:372)
	at java.util.ServiceLoader$LazyIterator.next(ServiceLoader.java:404)
	at java.util.ServiceLoader$1.next(ServiceLoader.java:480)
	at org.apache.hadoop.security.token.Token.getClassForIdentifier(Token.java:117)
	at org.apache.hadoop.security.token.Token.decodeIdentifier(Token.java:138)
	at org.apache.hadoop.yarn.server.resourcemanager.MockAM.registerAppAttempt(MockAM.java:126)
	at org.apache.hadoop.yarn.server.resourcemanager.MockAM.registerAppAttempt(MockAM.java:106)
	at org.apache.hadoop.yarn.server.resourcemanager.ahs.TestRMApplicationHistoryWriter.testRMWritingMassiveHistory(TestRMApplicationHistoryWriter.java:452)
	at org.apache.hadoop.yarn.server.resourcemanager.ahs.TestRMApplicationHistoryWriter.testRMWritingMassiveHistory(TestRMApplicationHistoryWriter.java:431)
	at org.apache.hadoop.yarn.server.resourcemanager.ahs.TestRMApplicationHistoryWriter.testRMWritingMassiveHistoryForFairSche(TestRMApplicationHistoryWriter.java:377)


FAILED:  org.apache.hadoop.yarn.server.resourcemanager.ahs.TestRMApplicationHistoryWriter.testRMWritingMassiveHistoryForCapacitySche

Error Message:
org.apache.hadoop.yarn.server.resourcemanager.scheduler.fair.FSQueueMetrics cannot be cast
to org.apache.hadoop.yarn.server.resourcemanager.scheduler.capacity.CSQueueMetrics

Stack Trace:
java.lang.ClassCastException: org.apache.hadoop.yarn.server.resourcemanager.scheduler.fair.FSQueueMetrics
cannot be cast to org.apache.hadoop.yarn.server.resourcemanager.scheduler.capacity.CSQueueMetrics
	at org.apache.hadoop.yarn.server.resourcemanager.scheduler.capacity.CSQueueMetrics.forQueue(CSQueueMetrics.java:112)
	at org.apache.hadoop.yarn.server.resourcemanager.scheduler.capacity.AbstractCSQueue.<init>(AbstractCSQueue.java:103)
	at org.apache.hadoop.yarn.server.resourcemanager.scheduler.capacity.ParentQueue.<init>(ParentQueue.java:87)
	at org.apache.hadoop.yarn.server.resourcemanager.scheduler.capacity.CapacityScheduler.parseQueue(CapacityScheduler.java:654)
	at org.apache.hadoop.yarn.server.resourcemanager.scheduler.capacity.CapacityScheduler.initializeQueues(CapacityScheduler.java:508)
	at org.apache.hadoop.yarn.server.resourcemanager.scheduler.capacity.CapacityScheduler.initScheduler(CapacityScheduler.java:310)
	at org.apache.hadoop.yarn.server.resourcemanager.scheduler.capacity.CapacityScheduler.serviceInit(CapacityScheduler.java:341)
	at org.apache.hadoop.service.AbstractService.init(AbstractService.java:163)
	at org.apache.hadoop.service.CompositeService.serviceInit(CompositeService.java:107)
	at org.apache.hadoop.yarn.server.resourcemanager.ResourceManager$RMActiveServices.serviceInit(ResourceManager.java:647)
	at org.apache.hadoop.service.AbstractService.init(AbstractService.java:163)
	at org.apache.hadoop.yarn.server.resourcemanager.ResourceManager.createAndInitActiveServices(ResourceManager.java:1087)
	at org.apache.hadoop.yarn.server.resourcemanager.ResourceManager.serviceInit(ResourceManager.java:286)
	at org.apache.hadoop.service.AbstractService.init(AbstractService.java:163)
	at org.apache.hadoop.yarn.server.resourcemanager.MockRM.<init>(MockRM.java:127)
	at org.apache.hadoop.yarn.server.resourcemanager.MockRM.<init>(MockRM.java:120)
	at org.apache.hadoop.yarn.server.resourcemanager.MockRM.<init>(MockRM.java:116)
	at org.apache.hadoop.yarn.server.resourcemanager.ahs.TestRMApplicationHistoryWriter$2.<init>(TestRMApplicationHistoryWriter.java:399)
	at org.apache.hadoop.yarn.server.resourcemanager.ahs.TestRMApplicationHistoryWriter.testRMWritingMassiveHistory(TestRMApplicationHistoryWriter.java:399)
	at org.apache.hadoop.yarn.server.resourcemanager.ahs.TestRMApplicationHistoryWriter.testRMWritingMassiveHistoryForCapacitySche(TestRMApplicationHistoryWriter.java:383)


FAILED:  org.apache.hadoop.yarn.server.resourcemanager.TestRMAdminService.testResourcePersistentForNMRegistrationWithNewResource

Error Message:
expected:<<memory:[4096, vCores:4]>> but was:<<memory:[5120, vCores:5]>>

Stack Trace:
org.junit.ComparisonFailure: expected:<<memory:[4096, vCores:4]>> but was:<<memory:[5120,
vCores:5]>>
	at org.junit.Assert.assertEquals(Assert.java:115)
	at org.junit.Assert.assertEquals(Assert.java:144)
	at org.apache.hadoop.yarn.server.resourcemanager.TestRMAdminService.testResourcePersistentForNMRegistrationWithNewResource(TestRMAdminService.java:287)



Mime
  • Unnamed multipart/mixed (inline, None, 0 bytes)
View raw message