hadoop-yarn-dev mailing list archives

Site index · List index
Message view « Date » · « Thread »
Top « Date » · « Thread »
From Apache Jenkins Server <jenk...@builds.apache.org>
Subject Build failed in Jenkins: Hadoop-Yarn-trunk #1995
Date Sat, 09 Apr 2016 01:12:52 GMT
See <https://builds.apache.org/job/Hadoop-Yarn-trunk/1995/changes>

Changes:

[wangda] YARN-3215. Respect labels in CapacityScheduler when computing headroom.

[wangda] YARN-4826. Document configuration of ReservationSystem for

------------------------------------------
[...truncated 10314 lines...]
Running org.apache.hadoop.yarn.server.resourcemanager.TestApplicationMasterService
Tests run: 8, Failures: 0, Errors: 0, Skipped: 0, Time elapsed: 50.738 sec - in org.apache.hadoop.yarn.server.resourcemanager.TestApplicationMasterService
Running org.apache.hadoop.yarn.server.resourcemanager.TestApplicationACLs
Tests run: 1, Failures: 0, Errors: 0, Skipped: 0, Time elapsed: 9.181 sec - in org.apache.hadoop.yarn.server.resourcemanager.TestApplicationACLs
Running org.apache.hadoop.yarn.server.resourcemanager.TestTokenClientRMService
Tests run: 6, Failures: 0, Errors: 0, Skipped: 0, Time elapsed: 1.521 sec - in org.apache.hadoop.yarn.server.resourcemanager.TestTokenClientRMService
Running org.apache.hadoop.yarn.server.resourcemanager.recovery.TestZKRMStateStore
Tests run: 6, Failures: 0, Errors: 0, Skipped: 0, Time elapsed: 18.421 sec - in org.apache.hadoop.yarn.server.resourcemanager.recovery.TestZKRMStateStore
Running org.apache.hadoop.yarn.server.resourcemanager.recovery.TestZKRMStateStoreZKClientConnections
Tests run: 4, Failures: 0, Errors: 0, Skipped: 0, Time elapsed: 8.805 sec - in org.apache.hadoop.yarn.server.resourcemanager.recovery.TestZKRMStateStoreZKClientConnections
Running org.apache.hadoop.yarn.server.resourcemanager.recovery.TestFSRMStateStore
Tests run: 4, Failures: 0, Errors: 0, Skipped: 0, Time elapsed: 36.404 sec - in org.apache.hadoop.yarn.server.resourcemanager.recovery.TestFSRMStateStore
Running org.apache.hadoop.yarn.server.resourcemanager.recovery.TestZKRMStateStorePerf
Tests run: 1, Failures: 0, Errors: 0, Skipped: 0, Time elapsed: 256.205 sec - in org.apache.hadoop.yarn.server.resourcemanager.recovery.TestZKRMStateStorePerf
Running org.apache.hadoop.yarn.server.resourcemanager.recovery.TestLeveldbRMStateStore
Tests run: 10, Failures: 0, Errors: 0, Skipped: 0, Time elapsed: 9.683 sec - in org.apache.hadoop.yarn.server.resourcemanager.recovery.TestLeveldbRMStateStore
Running org.apache.hadoop.yarn.server.resourcemanager.recovery.TestMemoryRMStateStore
Tests run: 1, Failures: 0, Errors: 0, Skipped: 0, Time elapsed: 0.777 sec - in org.apache.hadoop.yarn.server.resourcemanager.recovery.TestMemoryRMStateStore
Running org.apache.hadoop.yarn.server.resourcemanager.recovery.TestProtos
Tests run: 1, Failures: 0, Errors: 0, Skipped: 0, Time elapsed: 0.228 sec - in org.apache.hadoop.yarn.server.resourcemanager.recovery.TestProtos
Running org.apache.hadoop.yarn.server.resourcemanager.TestKillApplicationWithRMHA
Tests run: 4, Failures: 0, Errors: 0, Skipped: 0, Time elapsed: 25.221 sec - in org.apache.hadoop.yarn.server.resourcemanager.TestKillApplicationWithRMHA
Running org.apache.hadoop.yarn.server.resourcemanager.monitor.TestSchedulingMonitor
Tests run: 1, Failures: 0, Errors: 0, Skipped: 0, Time elapsed: 1.753 sec - in org.apache.hadoop.yarn.server.resourcemanager.monitor.TestSchedulingMonitor
Running org.apache.hadoop.yarn.server.resourcemanager.monitor.capacity.TestProportionalCapacityPreemptionPolicy
Tests run: 27, Failures: 0, Errors: 0, Skipped: 0, Time elapsed: 14.924 sec - in org.apache.hadoop.yarn.server.resourcemanager.monitor.capacity.TestProportionalCapacityPreemptionPolicy
Running org.apache.hadoop.yarn.server.resourcemanager.monitor.capacity.TestProportionalCapacityPreemptionPolicyForNodePartitions
Tests run: 11, Failures: 0, Errors: 0, Skipped: 0, Time elapsed: 5.617 sec - in org.apache.hadoop.yarn.server.resourcemanager.monitor.capacity.TestProportionalCapacityPreemptionPolicyForNodePartitions
Running org.apache.hadoop.yarn.server.resourcemanager.resourcetracker.TestNMReconnect
Tests run: 3, Failures: 0, Errors: 0, Skipped: 0, Time elapsed: 2.373 sec - in org.apache.hadoop.yarn.server.resourcemanager.resourcetracker.TestNMReconnect
Running org.apache.hadoop.yarn.server.resourcemanager.resourcetracker.TestNMExpiry
Tests run: 1, Failures: 0, Errors: 0, Skipped: 0, Time elapsed: 3.406 sec - in org.apache.hadoop.yarn.server.resourcemanager.resourcetracker.TestNMExpiry
Running org.apache.hadoop.yarn.server.resourcemanager.resourcetracker.TestRMNMRPCResponseId
Tests run: 1, Failures: 0, Errors: 0, Skipped: 0, Time elapsed: 1.496 sec - in org.apache.hadoop.yarn.server.resourcemanager.resourcetracker.TestRMNMRPCResponseId
Running org.apache.hadoop.yarn.server.resourcemanager.TestLeaderElectorService
Tests run: 6, Failures: 0, Errors: 0, Skipped: 0, Time elapsed: 34.718 sec - in org.apache.hadoop.yarn.server.resourcemanager.TestLeaderElectorService
Running org.apache.hadoop.yarn.server.resourcemanager.TestResourceManager
Tests run: 5, Failures: 0, Errors: 0, Skipped: 0, Time elapsed: 4.46 sec - in org.apache.hadoop.yarn.server.resourcemanager.TestResourceManager
Running org.apache.hadoop.yarn.server.resourcemanager.TestRMNodeTransitions
Tests run: 33, Failures: 0, Errors: 0, Skipped: 0, Time elapsed: 2.045 sec - in org.apache.hadoop.yarn.server.resourcemanager.TestRMNodeTransitions
Running org.apache.hadoop.yarn.server.resourcemanager.rmcontainer.TestRMContainerImpl
Tests run: 5, Failures: 0, Errors: 0, Skipped: 0, Time elapsed: 21.525 sec - in org.apache.hadoop.yarn.server.resourcemanager.rmcontainer.TestRMContainerImpl
Running org.apache.hadoop.yarn.server.resourcemanager.TestRMProxyUsersConf
Tests run: 3, Failures: 0, Errors: 0, Skipped: 0, Time elapsed: 32.135 sec - in org.apache.hadoop.yarn.server.resourcemanager.TestRMProxyUsersConf
Running org.apache.hadoop.yarn.server.resourcemanager.TestClusterMetrics
Tests run: 1, Failures: 0, Errors: 0, Skipped: 0, Time elapsed: 0.431 sec - in org.apache.hadoop.yarn.server.resourcemanager.TestClusterMetrics
Running org.apache.hadoop.yarn.server.resourcemanager.resource.TestResourceWeights
Tests run: 1, Failures: 0, Errors: 0, Skipped: 0, Time elapsed: 0.076 sec - in org.apache.hadoop.yarn.server.resourcemanager.resource.TestResourceWeights
Running org.apache.hadoop.yarn.server.resourcemanager.resource.TestResources
Tests run: 2, Failures: 0, Errors: 0, Skipped: 0, Time elapsed: 0.511 sec - in org.apache.hadoop.yarn.server.resourcemanager.resource.TestResources
Running org.apache.hadoop.yarn.server.resourcemanager.TestApplicationCleanup
Tests run: 7, Failures: 0, Errors: 0, Skipped: 0, Time elapsed: 42.103 sec - in org.apache.hadoop.yarn.server.resourcemanager.TestApplicationCleanup
Running org.apache.hadoop.yarn.server.resourcemanager.TestContainerResourceUsage
Tests run: 4, Failures: 0, Errors: 0, Skipped: 0, Time elapsed: 43.917 sec - in org.apache.hadoop.yarn.server.resourcemanager.TestContainerResourceUsage
Running org.apache.hadoop.yarn.server.resourcemanager.TestRMEmbeddedElector
Tests run: 1, Failures: 0, Errors: 0, Skipped: 0, Time elapsed: 3.369 sec - in org.apache.hadoop.yarn.server.resourcemanager.TestRMEmbeddedElector
Running org.apache.hadoop.yarn.server.resourcemanager.ahs.TestRMApplicationHistoryWriter
Tests run: 7, Failures: 0, Errors: 0, Skipped: 0, Time elapsed: 170.409 sec - in org.apache.hadoop.yarn.server.resourcemanager.ahs.TestRMApplicationHistoryWriter
Running org.apache.hadoop.yarn.webapp.TestRMWithCSRFFilter
Tests run: 4, Failures: 0, Errors: 4, Skipped: 0, Time elapsed: 0.433 sec <<< FAILURE!
- in org.apache.hadoop.yarn.webapp.TestRMWithCSRFFilter
testAllowNonBrowserInteractionWithoutHeader(org.apache.hadoop.yarn.webapp.TestRMWithCSRFFilter)
 Time elapsed: 0.007 sec  <<< ERROR!
com.sun.jersey.test.framework.spi.container.TestContainerException: java.net.BindException:
Address already in use
	at sun.nio.ch.Net.bind0(Native Method)
	at sun.nio.ch.Net.bind(Net.java:444)
	at sun.nio.ch.Net.bind(Net.java:436)
	at sun.nio.ch.ServerSocketChannelImpl.bind(ServerSocketChannelImpl.java:214)
	at sun.nio.ch.ServerSocketAdaptor.bind(ServerSocketAdaptor.java:74)
	at org.glassfish.grizzly.nio.transport.TCPNIOTransport.bind(TCPNIOTransport.java:413)
	at org.glassfish.grizzly.nio.transport.TCPNIOTransport.bind(TCPNIOTransport.java:384)
	at org.glassfish.grizzly.nio.transport.TCPNIOTransport.bind(TCPNIOTransport.java:375)
	at org.glassfish.grizzly.http.server.NetworkListener.start(NetworkListener.java:549)
	at org.glassfish.grizzly.http.server.HttpServer.start(HttpServer.java:255)
	at com.sun.jersey.api.container.grizzly2.GrizzlyServerFactory.createHttpServer(GrizzlyServerFactory.java:326)
	at com.sun.jersey.api.container.grizzly2.GrizzlyServerFactory.createHttpServer(GrizzlyServerFactory.java:343)
	at com.sun.jersey.test.framework.spi.container.grizzly2.web.GrizzlyWebTestContainerFactory$GrizzlyWebTestContainer.instantiateGrizzlyWebServer(GrizzlyWebTestContainerFactory.java:219)
	at com.sun.jersey.test.framework.spi.container.grizzly2.web.GrizzlyWebTestContainerFactory$GrizzlyWebTestContainer.<init>(GrizzlyWebTestContainerFactory.java:129)
	at com.sun.jersey.test.framework.spi.container.grizzly2.web.GrizzlyWebTestContainerFactory$GrizzlyWebTestContainer.<init>(GrizzlyWebTestContainerFactory.java:86)
	at com.sun.jersey.test.framework.spi.container.grizzly2.web.GrizzlyWebTestContainerFactory.create(GrizzlyWebTestContainerFactory.java:79)
	at com.sun.jersey.test.framework.JerseyTest.getContainer(JerseyTest.java:342)
	at com.sun.jersey.test.framework.JerseyTest.<init>(JerseyTest.java:217)
	at org.apache.hadoop.yarn.webapp.JerseyTestBase.<init>(JerseyTestBase.java:30)
	at org.apache.hadoop.yarn.webapp.TestRMWithCSRFFilter.<init>(TestRMWithCSRFFilter.java:109)

testAllowedMethod(org.apache.hadoop.yarn.webapp.TestRMWithCSRFFilter)  Time elapsed: 0.001
sec  <<< ERROR!
com.sun.jersey.test.framework.spi.container.TestContainerException: java.net.BindException:
Address already in use
	at sun.nio.ch.Net.bind0(Native Method)
	at sun.nio.ch.Net.bind(Net.java:444)
	at sun.nio.ch.Net.bind(Net.java:436)
	at sun.nio.ch.ServerSocketChannelImpl.bind(ServerSocketChannelImpl.java:214)
	at sun.nio.ch.ServerSocketAdaptor.bind(ServerSocketAdaptor.java:74)
	at org.glassfish.grizzly.nio.transport.TCPNIOTransport.bind(TCPNIOTransport.java:413)
	at org.glassfish.grizzly.nio.transport.TCPNIOTransport.bind(TCPNIOTransport.java:384)
	at org.glassfish.grizzly.nio.transport.TCPNIOTransport.bind(TCPNIOTransport.java:375)
	at org.glassfish.grizzly.http.server.NetworkListener.start(NetworkListener.java:549)
	at org.glassfish.grizzly.http.server.HttpServer.start(HttpServer.java:255)
	at com.sun.jersey.api.container.grizzly2.GrizzlyServerFactory.createHttpServer(GrizzlyServerFactory.java:326)
	at com.sun.jersey.api.container.grizzly2.GrizzlyServerFactory.createHttpServer(GrizzlyServerFactory.java:343)
	at com.sun.jersey.test.framework.spi.container.grizzly2.web.GrizzlyWebTestContainerFactory$GrizzlyWebTestContainer.instantiateGrizzlyWebServer(GrizzlyWebTestContainerFactory.java:219)
	at com.sun.jersey.test.framework.spi.container.grizzly2.web.GrizzlyWebTestContainerFactory$GrizzlyWebTestContainer.<init>(GrizzlyWebTestContainerFactory.java:129)
	at com.sun.jersey.test.framework.spi.container.grizzly2.web.GrizzlyWebTestContainerFactory$GrizzlyWebTestContainer.<init>(GrizzlyWebTestContainerFactory.java:86)
	at com.sun.jersey.test.framework.spi.container.grizzly2.web.GrizzlyWebTestContainerFactory.create(GrizzlyWebTestContainerFactory.java:79)
	at com.sun.jersey.test.framework.JerseyTest.getContainer(JerseyTest.java:342)
	at com.sun.jersey.test.framework.JerseyTest.<init>(JerseyTest.java:217)
	at org.apache.hadoop.yarn.webapp.JerseyTestBase.<init>(JerseyTestBase.java:30)
	at org.apache.hadoop.yarn.webapp.TestRMWithCSRFFilter.<init>(TestRMWithCSRFFilter.java:109)

testNoCustomHeaderFromBrowser(org.apache.hadoop.yarn.webapp.TestRMWithCSRFFilter)  Time elapsed:
0.001 sec  <<< ERROR!
com.sun.jersey.test.framework.spi.container.TestContainerException: java.net.BindException:
Address already in use
	at sun.nio.ch.Net.bind0(Native Method)
	at sun.nio.ch.Net.bind(Net.java:444)
	at sun.nio.ch.Net.bind(Net.java:436)
	at sun.nio.ch.ServerSocketChannelImpl.bind(ServerSocketChannelImpl.java:214)
	at sun.nio.ch.ServerSocketAdaptor.bind(ServerSocketAdaptor.java:74)
	at org.glassfish.grizzly.nio.transport.TCPNIOTransport.bind(TCPNIOTransport.java:413)
	at org.glassfish.grizzly.nio.transport.TCPNIOTransport.bind(TCPNIOTransport.java:384)
	at org.glassfish.grizzly.nio.transport.TCPNIOTransport.bind(TCPNIOTransport.java:375)
	at org.glassfish.grizzly.http.server.NetworkListener.start(NetworkListener.java:549)
	at org.glassfish.grizzly.http.server.HttpServer.start(HttpServer.java:255)
	at com.sun.jersey.api.container.grizzly2.GrizzlyServerFactory.createHttpServer(GrizzlyServerFactory.java:326)
	at com.sun.jersey.api.container.grizzly2.GrizzlyServerFactory.createHttpServer(GrizzlyServerFactory.java:343)
	at com.sun.jersey.test.framework.spi.container.grizzly2.web.GrizzlyWebTestContainerFactory$GrizzlyWebTestContainer.instantiateGrizzlyWebServer(GrizzlyWebTestContainerFactory.java:219)
	at com.sun.jersey.test.framework.spi.container.grizzly2.web.GrizzlyWebTestContainerFactory$GrizzlyWebTestContainer.<init>(GrizzlyWebTestContainerFactory.java:129)
	at com.sun.jersey.test.framework.spi.container.grizzly2.web.GrizzlyWebTestContainerFactory$GrizzlyWebTestContainer.<init>(GrizzlyWebTestContainerFactory.java:86)
	at com.sun.jersey.test.framework.spi.container.grizzly2.web.GrizzlyWebTestContainerFactory.create(GrizzlyWebTestContainerFactory.java:79)
	at com.sun.jersey.test.framework.JerseyTest.getContainer(JerseyTest.java:342)
	at com.sun.jersey.test.framework.JerseyTest.<init>(JerseyTest.java:217)
	at org.apache.hadoop.yarn.webapp.JerseyTestBase.<init>(JerseyTestBase.java:30)
	at org.apache.hadoop.yarn.webapp.TestRMWithCSRFFilter.<init>(TestRMWithCSRFFilter.java:109)

testIncludeCustomHeaderFromBrowser(org.apache.hadoop.yarn.webapp.TestRMWithCSRFFilter)  Time
elapsed: 0.001 sec  <<< ERROR!
com.sun.jersey.test.framework.spi.container.TestContainerException: java.net.BindException:
Address already in use
	at sun.nio.ch.Net.bind0(Native Method)
	at sun.nio.ch.Net.bind(Net.java:444)
	at sun.nio.ch.Net.bind(Net.java:436)
	at sun.nio.ch.ServerSocketChannelImpl.bind(ServerSocketChannelImpl.java:214)
	at sun.nio.ch.ServerSocketAdaptor.bind(ServerSocketAdaptor.java:74)
	at org.glassfish.grizzly.nio.transport.TCPNIOTransport.bind(TCPNIOTransport.java:413)
	at org.glassfish.grizzly.nio.transport.TCPNIOTransport.bind(TCPNIOTransport.java:384)
	at org.glassfish.grizzly.nio.transport.TCPNIOTransport.bind(TCPNIOTransport.java:375)
	at org.glassfish.grizzly.http.server.NetworkListener.start(NetworkListener.java:549)
	at org.glassfish.grizzly.http.server.HttpServer.start(HttpServer.java:255)
	at com.sun.jersey.api.container.grizzly2.GrizzlyServerFactory.createHttpServer(GrizzlyServerFactory.java:326)
	at com.sun.jersey.api.container.grizzly2.GrizzlyServerFactory.createHttpServer(GrizzlyServerFactory.java:343)
	at com.sun.jersey.test.framework.spi.container.grizzly2.web.GrizzlyWebTestContainerFactory$GrizzlyWebTestContainer.instantiateGrizzlyWebServer(GrizzlyWebTestContainerFactory.java:219)
	at com.sun.jersey.test.framework.spi.container.grizzly2.web.GrizzlyWebTestContainerFactory$GrizzlyWebTestContainer.<init>(GrizzlyWebTestContainerFactory.java:129)
	at com.sun.jersey.test.framework.spi.container.grizzly2.web.GrizzlyWebTestContainerFactory$GrizzlyWebTestContainer.<init>(GrizzlyWebTestContainerFactory.java:86)
	at com.sun.jersey.test.framework.spi.container.grizzly2.web.GrizzlyWebTestContainerFactory.create(GrizzlyWebTestContainerFactory.java:79)
	at com.sun.jersey.test.framework.JerseyTest.getContainer(JerseyTest.java:342)
	at com.sun.jersey.test.framework.JerseyTest.<init>(JerseyTest.java:217)
	at org.apache.hadoop.yarn.webapp.JerseyTestBase.<init>(JerseyTestBase.java:30)
	at org.apache.hadoop.yarn.webapp.TestRMWithCSRFFilter.<init>(TestRMWithCSRFFilter.java:109)


Results :

Tests in error: 
  TestRMWebServicesAppsModification.<init>:278->JerseyTestBase.<init>:30->JerseyTest.<init>:217->JerseyTest.getContainer:342
» TestContainer
  TestRMWebServicesAppsModification.<init>:278->JerseyTestBase.<init>:30->JerseyTest.<init>:217->JerseyTest.getContainer:342
» TestContainer
  TestRMWebServicesAppsModification.<init>:278->JerseyTestBase.<init>:30->JerseyTest.<init>:217->JerseyTest.getContainer:342
» TestContainer
  TestRMWebServicesAppsModification.<init>:278->JerseyTestBase.<init>:30->JerseyTest.<init>:217->JerseyTest.getContainer:342
» TestContainer
  TestRMWebServicesAppsModification.<init>:278->JerseyTestBase.<init>:30->JerseyTest.<init>:217->JerseyTest.getContainer:342
» TestContainer
  TestRMWebServicesAppsModification.<init>:278->JerseyTestBase.<init>:30->JerseyTest.<init>:217->JerseyTest.getContainer:342
» TestContainer
  TestRMWebServicesAppsModification.<init>:278->JerseyTestBase.<init>:30->JerseyTest.<init>:217->JerseyTest.getContainer:342
» TestContainer
  TestRMWebServicesAppsModification.<init>:278->JerseyTestBase.<init>:30->JerseyTest.<init>:217->JerseyTest.getContainer:342
» TestContainer
  TestRMWebServicesAppsModification.<init>:278->JerseyTestBase.<init>:30->JerseyTest.<init>:217->JerseyTest.getContainer:342
» TestContainer
  TestRMWebServicesAppsModification.<init>:278->JerseyTestBase.<init>:30->JerseyTest.<init>:217->JerseyTest.getContainer:342
» TestContainer
  TestRMWebServicesAppsModification.<init>:278->JerseyTestBase.<init>:30->JerseyTest.<init>:217->JerseyTest.getContainer:342
» TestContainer
  TestRMWebServicesAppsModification.<init>:278->JerseyTestBase.<init>:30->JerseyTest.<init>:217->JerseyTest.getContainer:342
» TestContainer
  TestRMWebServicesAppsModification.<init>:278->JerseyTestBase.<init>:30->JerseyTest.<init>:217->JerseyTest.getContainer:342
» TestContainer
  TestRMWebServicesAppsModification.<init>:278->JerseyTestBase.<init>:30->JerseyTest.<init>:217->JerseyTest.getContainer:342
» TestContainer
  TestRMWebServicesAppsModification.<init>:278->JerseyTestBase.<init>:30->JerseyTest.<init>:217->JerseyTest.getContainer:342
» TestContainer
  TestRMWebServicesAppsModification.<init>:278->JerseyTestBase.<init>:30->JerseyTest.<init>:217->JerseyTest.getContainer:342
» TestContainer
  TestRMWebServicesAppsModification.<init>:278->JerseyTestBase.<init>:30->JerseyTest.<init>:217->JerseyTest.getContainer:342
» TestContainer
  TestRMWebServicesAppsModification.<init>:278->JerseyTestBase.<init>:30->JerseyTest.<init>:217->JerseyTest.getContainer:342
» TestContainer
  TestRMWebServicesAppsModification.<init>:278->JerseyTestBase.<init>:30->JerseyTest.<init>:217->JerseyTest.getContainer:342
» TestContainer
  TestRMWebServicesAppsModification.<init>:278->JerseyTestBase.<init>:30->JerseyTest.<init>:217->JerseyTest.getContainer:342
» TestContainer
  TestRMWebServicesAppsModification.<init>:278->JerseyTestBase.<init>:30->JerseyTest.<init>:217->JerseyTest.getContainer:342
» TestContainer
  TestRMWebServicesAppsModification.<init>:278->JerseyTestBase.<init>:30->JerseyTest.<init>:217->JerseyTest.getContainer:342
» TestContainer
  TestRMWebServicesAppsModification.<init>:278->JerseyTestBase.<init>:30->JerseyTest.<init>:217->JerseyTest.getContainer:342
» TestContainer
  TestRMWebServicesAppsModification.<init>:278->JerseyTestBase.<init>:30->JerseyTest.<init>:217->JerseyTest.getContainer:342
» TestContainer
  TestRMWebServicesAppsModification.<init>:278->JerseyTestBase.<init>:30->JerseyTest.<init>:217->JerseyTest.getContainer:342
» TestContainer
  TestRMWebServicesAppsModification.<init>:278->JerseyTestBase.<init>:30->JerseyTest.<init>:217->JerseyTest.getContainer:342
» TestContainer
  TestRMWebServicesAppsModification.<init>:278->JerseyTestBase.<init>:30->JerseyTest.<init>:217->JerseyTest.getContainer:342
» TestContainer
  TestRMWebServicesAppsModification.<init>:278->JerseyTestBase.<init>:30->JerseyTest.<init>:217->JerseyTest.getContainer:342
» TestContainer
  TestRMWebServicesAppsModification.<init>:278->JerseyTestBase.<init>:30->JerseyTest.<init>:217->JerseyTest.getContainer:342
» TestContainer
  TestRMWebServicesAppsModification.<init>:278->JerseyTestBase.<init>:30->JerseyTest.<init>:217->JerseyTest.getContainer:342
» TestContainer
  TestRMWebServicesAppsModification.<init>:278->JerseyTestBase.<init>:30->JerseyTest.<init>:217->JerseyTest.getContainer:342
» TestContainer
  TestRMWebServicesAppsModification.<init>:278->JerseyTestBase.<init>:30->JerseyTest.<init>:217->JerseyTest.getContainer:342
» TestContainer
  TestRMWebServicesAppsModification.<init>:278->JerseyTestBase.<init>:30->JerseyTest.<init>:217->JerseyTest.getContainer:342
» TestContainer
  TestRMWebServicesAppsModification.<init>:278->JerseyTestBase.<init>:30->JerseyTest.<init>:217->JerseyTest.getContainer:342
» TestContainer
  TestRMWebServicesAppsModification.<init>:278->JerseyTestBase.<init>:30->JerseyTest.<init>:217->JerseyTest.getContainer:342
» TestContainer
  TestRMWebServicesAppsModification.<init>:278->JerseyTestBase.<init>:30->JerseyTest.<init>:217->JerseyTest.getContainer:342
» TestContainer
  TestRMWebServicesAppsModification.<init>:278->JerseyTestBase.<init>:30->JerseyTest.<init>:217->JerseyTest.getContainer:342
» TestContainer
  TestRMWebServicesAppsModification.<init>:278->JerseyTestBase.<init>:30->JerseyTest.<init>:217->JerseyTest.getContainer:342
» TestContainer
  TestRMWebServicesAppsModification.<init>:278->JerseyTestBase.<init>:30->JerseyTest.<init>:217->JerseyTest.getContainer:342
» TestContainer
  TestRMWebServicesAppsModification.<init>:278->JerseyTestBase.<init>:30->JerseyTest.<init>:217->JerseyTest.getContainer:342
» TestContainer
  TestRMWebServicesAppsModification.<init>:278->JerseyTestBase.<init>:30->JerseyTest.<init>:217->JerseyTest.getContainer:342
» TestContainer
  TestRMWebServicesAppsModification.<init>:278->JerseyTestBase.<init>:30->JerseyTest.<init>:217->JerseyTest.getContainer:342
» TestContainer
  TestRMWebServicesAppsModification.<init>:278->JerseyTestBase.<init>:30->JerseyTest.<init>:217->JerseyTest.getContainer:342
» TestContainer
  TestRMWebServicesAppsModification.<init>:278->JerseyTestBase.<init>:30->JerseyTest.<init>:217->JerseyTest.getContainer:342
» TestContainer
  TestRMWithCSRFFilter.<init>:109->JerseyTestBase.<init>:30->JerseyTest.<init>:217->JerseyTest.getContainer:342
» TestContainer
  TestRMWithCSRFFilter.<init>:109->JerseyTestBase.<init>:30->JerseyTest.<init>:217->JerseyTest.getContainer:342
» TestContainer
  TestRMWithCSRFFilter.<init>:109->JerseyTestBase.<init>:30->JerseyTest.<init>:217->JerseyTest.getContainer:342
» TestContainer
  TestRMWithCSRFFilter.<init>:109->JerseyTestBase.<init>:30->JerseyTest.<init>:217->JerseyTest.getContainer:342
» TestContainer

Tests run: 1348, Failures: 0, Errors: 48, Skipped: 3

[INFO] ------------------------------------------------------------------------
[INFO] Reactor Summary:
[INFO] 
[INFO] Apache Hadoop YARN ................................ SUCCESS [  3.245 s]
[INFO] Apache Hadoop YARN API ............................ SUCCESS [04:17 min]
[INFO] Apache Hadoop YARN Common ......................... SUCCESS [03:01 min]
[INFO] Apache Hadoop YARN Server ......................... SUCCESS [  0.096 s]
[INFO] Apache Hadoop YARN Server Common .................. SUCCESS [ 46.016 s]
[INFO] Apache Hadoop YARN NodeManager .................... SUCCESS [10:11 min]
[INFO] Apache Hadoop YARN Web Proxy ...................... SUCCESS [ 25.801 s]
[INFO] Apache Hadoop YARN ApplicationHistoryService ...... SUCCESS [04:07 min]
[INFO] Apache Hadoop YARN ResourceManager ................ FAILURE [  01:17 h]
[INFO] Apache Hadoop YARN Server Tests ................... SKIPPED
[INFO] Apache Hadoop YARN Client ......................... SKIPPED
[INFO] Apache Hadoop YARN SharedCacheManager ............. SKIPPED
[INFO] Apache Hadoop YARN Timeline Plugin Storage ........ SKIPPED
[INFO] Apache Hadoop YARN Applications ................... SKIPPED
[INFO] Apache Hadoop YARN DistributedShell ............... SKIPPED
[INFO] Apache Hadoop YARN Unmanaged Am Launcher .......... SKIPPED
[INFO] Apache Hadoop YARN Site ........................... SKIPPED
[INFO] Apache Hadoop YARN Registry ....................... SKIPPED
[INFO] Apache Hadoop YARN Project ........................ SKIPPED
[INFO] ------------------------------------------------------------------------
[INFO] BUILD FAILURE
[INFO] ------------------------------------------------------------------------
[INFO] Total time: 01:40 h
[INFO] Finished at: 2016-04-09T01:12:52+00:00
[INFO] Final Memory: 63M/523M
[INFO] ------------------------------------------------------------------------
[ERROR] Failed to execute goal org.apache.maven.plugins:maven-surefire-plugin:2.17:test (default-test)
on project hadoop-yarn-server-resourcemanager: There was a timeout or other error in the fork
-> [Help 1]
[ERROR] 
[ERROR] To see the full stack trace of the errors, re-run Maven with the -e switch.
[ERROR] Re-run Maven using the -X switch to enable full debug logging.
[ERROR] 
[ERROR] For more information about the errors and possible solutions, please read the following
articles:
[ERROR] [Help 1] http://cwiki.apache.org/confluence/display/MAVEN/MojoFailureException
[ERROR] 
[ERROR] After correcting the problems, you can resume the build with the command
[ERROR]   mvn <goals> -rf :hadoop-yarn-server-resourcemanager
Build step 'Execute shell' marked build as failure
Archiving artifacts
Recording test results

Mime
View raw message