hadoop-yarn-dev mailing list archives

Site index · List index
Message view « Date » · « Thread »
Top « Date » · « Thread »
From Apache Jenkins Server <jenk...@builds.apache.org>
Subject Hadoop-Yarn-trunk - Build # 2038 - Still Failing
Date Tue, 19 Apr 2016 19:25:38 GMT
See https://builds.apache.org/job/Hadoop-Yarn-trunk/2038/

###################################################################################
########################## LAST 60 LINES OF THE CONSOLE ###########################
[...truncated 5643 lines...]
-> at org.apache.hadoop.yarn.logaggregation.TestAggregatedLogDeletionService.testRefreshLogRetentionSettings(TestAggregatedLogDeletionService.java:300)
Actual invocation has different arguments:
fileSystem.delete(
    mockfs://foo/tmp/logs/me/logs/application_1461093771620_0001,
    true
);
-> at org.apache.hadoop.fs.FilterFileSystem.delete(FilterFileSystem.java:245)


Tests run: 340, Failures: 1, Errors: 0, Skipped: 7

[INFO] ------------------------------------------------------------------------
[INFO] Reactor Summary:
[INFO] 
[INFO] Apache Hadoop YARN ................................ SUCCESS [  8.641 s]
[INFO] Apache Hadoop YARN API ............................ SUCCESS [08:52 min]
[INFO] Apache Hadoop YARN Common ......................... FAILURE [03:53 min]
[INFO] Apache Hadoop YARN Server ......................... SKIPPED
[INFO] Apache Hadoop YARN Server Common .................. SKIPPED
[INFO] Apache Hadoop YARN NodeManager .................... SKIPPED
[INFO] Apache Hadoop YARN Web Proxy ...................... SKIPPED
[INFO] Apache Hadoop YARN ApplicationHistoryService ...... SKIPPED
[INFO] Apache Hadoop YARN ResourceManager ................ SKIPPED
[INFO] Apache Hadoop YARN Server Tests ................... SKIPPED
[INFO] Apache Hadoop YARN Client ......................... SKIPPED
[INFO] Apache Hadoop YARN SharedCacheManager ............. SKIPPED
[INFO] Apache Hadoop YARN Timeline Plugin Storage ........ SKIPPED
[INFO] Apache Hadoop YARN Applications ................... SKIPPED
[INFO] Apache Hadoop YARN DistributedShell ............... SKIPPED
[INFO] Apache Hadoop YARN Unmanaged Am Launcher .......... SKIPPED
[INFO] Apache Hadoop YARN Site ........................... SKIPPED
[INFO] Apache Hadoop YARN Registry ....................... SKIPPED
[INFO] Apache Hadoop YARN Project ........................ SKIPPED
[INFO] ------------------------------------------------------------------------
[INFO] BUILD FAILURE
[INFO] ------------------------------------------------------------------------
[INFO] Total time: 12:57 min
[INFO] Finished at: 2016-04-19T19:25:37+00:00
[INFO] Final Memory: 68M/940M
[INFO] ------------------------------------------------------------------------
[ERROR] Failed to execute goal org.apache.maven.plugins:maven-surefire-plugin:2.17:test (default-test)
on project hadoop-yarn-common: There are test failures.
[ERROR] 
[ERROR] Please refer to /home/jenkins/jenkins-slave/workspace/Hadoop-Yarn-trunk/hadoop-yarn-project/hadoop-yarn/hadoop-yarn-common/target/surefire-reports
for the individual test results.
[ERROR] -> [Help 1]
[ERROR] 
[ERROR] To see the full stack trace of the errors, re-run Maven with the -e switch.
[ERROR] Re-run Maven using the -X switch to enable full debug logging.
[ERROR] 
[ERROR] For more information about the errors and possible solutions, please read the following
articles:
[ERROR] [Help 1] http://cwiki.apache.org/confluence/display/MAVEN/MojoFailureException
[ERROR] 
[ERROR] After correcting the problems, you can resume the build with the command
[ERROR]   mvn <goals> -rf :hadoop-yarn-common
Build step 'Execute shell' marked build as failure
Archiving artifacts
Recording test results
Sending e-mails to: yarn-dev@hadoop.apache.org
Email was triggered for: Failure - Any
Sending email for trigger: Failure - Any



###################################################################################
############################## FAILED TESTS (if any) ##############################
1 tests failed.
FAILED:  org.apache.hadoop.yarn.logaggregation.TestAggregatedLogDeletionService.testRefreshLogRetentionSettings

Error Message:

Argument(s) are different! Wanted:
fileSystem.delete(
    mockfs://foo/tmp/logs/me/logs/application_1461093771859_0002,
    true
);
-> at org.apache.hadoop.yarn.logaggregation.TestAggregatedLogDeletionService.testRefreshLogRetentionSettings(TestAggregatedLogDeletionService.java:300)
Actual invocation has different arguments:
fileSystem.delete(
    mockfs://foo/tmp/logs/me/logs/application_1461093771620_0001,
    true
);
-> at org.apache.hadoop.fs.FilterFileSystem.delete(FilterFileSystem.java:245)


Stack Trace:
org.mockito.exceptions.verification.junit.ArgumentsAreDifferent: 
Argument(s) are different! Wanted:
fileSystem.delete(
    mockfs://foo/tmp/logs/me/logs/application_1461093771859_0002,
    true
);
-> at org.apache.hadoop.yarn.logaggregation.TestAggregatedLogDeletionService.testRefreshLogRetentionSettings(TestAggregatedLogDeletionService.java:300)
Actual invocation has different arguments:
fileSystem.delete(
    mockfs://foo/tmp/logs/me/logs/application_1461093771620_0001,
    true
);
-> at org.apache.hadoop.fs.FilterFileSystem.delete(FilterFileSystem.java:245)

	at sun.reflect.NativeConstructorAccessorImpl.newInstance0(Native Method)
	at sun.reflect.NativeConstructorAccessorImpl.newInstance(NativeConstructorAccessorImpl.java:57)
	at sun.reflect.DelegatingConstructorAccessorImpl.newInstance(DelegatingConstructorAccessorImpl.java:45)
	at java.lang.reflect.Constructor.newInstance(Constructor.java:526)
	at org.apache.hadoop.yarn.logaggregation.TestAggregatedLogDeletionService.testRefreshLogRetentionSettings(TestAggregatedLogDeletionService.java:300)



Mime
  • Unnamed multipart/mixed (inline, None, 0 bytes)
View raw message