hadoop-yarn-dev mailing list archives

Site index · List index
Message view « Date » · « Thread »
Top « Date » · « Thread »
From Apache Jenkins Server <jenk...@builds.apache.org>
Subject Build failed in Jenkins: Hadoop-Yarn-trunk-Java8 #1294
Date Tue, 12 Apr 2016 22:16:26 GMT
See <https://builds.apache.org/job/Hadoop-Yarn-trunk-Java8/1294/changes>

Changes:

[zhz] HDFS-9918. Erasure Coding: Sort located striped blocks based on

[rkanter] HADOOP-12964. Http server vulnerable to clickjacking (haibochen via

------------------------------------------
[...truncated 4977 lines...]
3200/3460 KB   
3200/3460 KB   
3204/3460 KB   
3208/3460 KB   
3208/3460 KB   
3212/3460 KB   
3216/3460 KB   
3216/3460 KB   
3219/3460 KB   
3223/3460 KB   
3224/3460 KB   
3227/3460 KB   
3231/3460 KB   
3232/3460 KB   
3235/3460 KB   
3239/3460 KB   
3240/3460 KB   
3243/3460 KB   
3247/3460 KB   
3248/3460 KB   
3251/3460 KB   
3255/3460 KB   
3256/3460 KB   
3259/3460 KB   
3263/3460 KB   
3264/3460 KB   
3266/3460 KB   
3270/3460 KB   
3272/3460 KB   
3274/3460 KB   
3278/3460 KB   
3280/3460 KB   
3282/3460 KB   
3286/3460 KB   
3288/3460 KB   
3290/3460 KB   
3294/3460 KB   
3296/3460 KB   
3298/3460 KB   
3302/3460 KB   
3304/3460 KB   
3305/3460 KB   
3309/3460 KB   
3312/3460 KB   
3313/3460 KB   
3317/3460 KB   
3320/3460 KB   
3321/3460 KB   
3325/3460 KB   
3328/3460 KB   
3329/3460 KB   
3333/3460 KB   
3336/3460 KB   
3337/3460 KB   
3341/3460 KB   
3344/3460 KB   
3348/3460 KB   
3352/3460 KB   
3352/3460 KB   
3356/3460 KB   
3360/3460 KB   
3360/3460 KB   
3364/3460 KB   
3368/3460 KB   
3368/3460 KB   
3372/3460 KB   
3376/3460 KB   
3376/3460 KB   
3380/3460 KB   
3384/3460 KB   
3384/3460 KB   
3388/3460 KB   
3391/3460 KB   
3392/3460 KB   
3396/3460 KB   
3399/3460 KB   
3400/3460 KB   
3404/3460 KB   
3407/3460 KB   
3408/3460 KB   
3412/3460 KB   
3415/3460 KB   
3416/3460 KB   
3420/3460 KB   
3423/3460 KB   
3424/3460 KB   
3428/3460 KB   
3430/3460 KB   
3432/3460 KB   
3436/3460 KB   
3438/3460 KB   
3440/3460 KB   
3444/3460 KB   
3446/3460 KB   
3448/3460 KB   
3452/3460 KB   
3454/3460 KB   
3456/3460 KB   
3460/3460 KB   
               
Downloaded: https://repository.apache.org/content/repositories/snapshots/org/apache/hadoop/hadoop-common/3.0.0-SNAPSHOT/hadoop-common-3.0.0-20160412.221507-7601.jar
(3460 KB at 2359.7 KB/sec)
[INFO] 
[INFO] --- maven-clean-plugin:2.5:clean (default-clean) @ hadoop-yarn-api ---
[INFO] Deleting <https://builds.apache.org/job/Hadoop-Yarn-trunk-Java8/ws/hadoop-yarn-project/hadoop-yarn/hadoop-yarn-api/target>
[INFO] 
[INFO] --- maven-antrun-plugin:1.7:run (create-testdirs) @ hadoop-yarn-api ---
[INFO] Executing tasks

main:
    [mkdir] Created dir: <https://builds.apache.org/job/Hadoop-Yarn-trunk-Java8/ws/hadoop-yarn-project/hadoop-yarn/hadoop-yarn-api/target/test-dir>
[INFO] Executed tasks
[INFO] 
[INFO] --- hadoop-maven-plugins:3.0.0-SNAPSHOT:protoc (compile-protoc) @ hadoop-yarn-api ---
[INFO] Wrote protoc checksums to file <https://builds.apache.org/job/Hadoop-Yarn-trunk-Java8/ws/hadoop-yarn-project/hadoop-yarn/hadoop-yarn-api/target/hadoop-maven-plugins-protoc-checksums.json>
[INFO] 
[INFO] --- maven-resources-plugin:2.6:resources (default-resources) @ hadoop-yarn-api ---
[INFO] Using 'UTF-8' encoding to copy filtered resources.
[INFO] Copying 1 resource
[INFO] 
[INFO] --- maven-compiler-plugin:3.1:compile (default-compile) @ hadoop-yarn-api ---
[INFO] Compiling 236 source files to <https://builds.apache.org/job/Hadoop-Yarn-trunk-Java8/ws/hadoop-yarn-project/hadoop-yarn/hadoop-yarn-api/target/classes>
[INFO] 
[INFO] --- maven-resources-plugin:2.6:testResources (default-testResources) @ hadoop-yarn-api
---
[INFO] Using 'UTF-8' encoding to copy filtered resources.
[INFO] skip non existing resourceDirectory <https://builds.apache.org/job/Hadoop-Yarn-trunk-Java8/ws/hadoop-yarn-project/hadoop-yarn/hadoop-yarn-api/src/test/resources>
[INFO] 
[INFO] --- maven-compiler-plugin:3.1:testCompile (default-testCompile) @ hadoop-yarn-api ---
[INFO] Compiling 1 source file to <https://builds.apache.org/job/Hadoop-Yarn-trunk-Java8/ws/hadoop-yarn-project/hadoop-yarn/hadoop-yarn-api/target/test-classes>
[INFO] 
[INFO] --- maven-jar-plugin:2.5:test-jar (default) @ hadoop-yarn-api ---
[INFO] Building jar: <https://builds.apache.org/job/Hadoop-Yarn-trunk-Java8/ws/hadoop-yarn-project/hadoop-yarn/hadoop-yarn-api/target/hadoop-yarn-api-3.0.0-SNAPSHOT-tests.jar>
[INFO] 
[INFO] --- maven-surefire-plugin:2.17:test (default-test) @ hadoop-yarn-api ---
[INFO] Surefire report directory: <https://builds.apache.org/job/Hadoop-Yarn-trunk-Java8/ws/hadoop-yarn-project/hadoop-yarn/hadoop-yarn-api/target/surefire-reports>

-------------------------------------------------------
 T E S T S
-------------------------------------------------------

-------------------------------------------------------
 T E S T S
-------------------------------------------------------
Java HotSpot(TM) 64-Bit Server VM warning: ignoring option MaxPermSize=768m; support was removed
in 8.0
Running org.apache.hadoop.yarn.conf.TestYarnConfigurationFields
Tests run: 2, Failures: 0, Errors: 0, Skipped: 0, Time elapsed: 0.636 sec - in org.apache.hadoop.yarn.conf.TestYarnConfigurationFields

Results :

Tests run: 2, Failures: 0, Errors: 0, Skipped: 0

[INFO] 
[INFO] --- maven-jar-plugin:2.5:jar (default-jar) @ hadoop-yarn-api ---
[INFO] Building jar: <https://builds.apache.org/job/Hadoop-Yarn-trunk-Java8/ws/hadoop-yarn-project/hadoop-yarn/hadoop-yarn-api/target/hadoop-yarn-api-3.0.0-SNAPSHOT.jar>
[INFO] 
[INFO] --- maven-source-plugin:2.3:jar-no-fork (hadoop-java-sources) @ hadoop-yarn-api ---
[INFO] Building jar: <https://builds.apache.org/job/Hadoop-Yarn-trunk-Java8/ws/hadoop-yarn-project/hadoop-yarn/hadoop-yarn-api/target/hadoop-yarn-api-3.0.0-SNAPSHOT-sources.jar>
[INFO] 
[INFO] --- maven-source-plugin:2.3:test-jar-no-fork (hadoop-java-sources) @ hadoop-yarn-api
---
[INFO] Building jar: <https://builds.apache.org/job/Hadoop-Yarn-trunk-Java8/ws/hadoop-yarn-project/hadoop-yarn/hadoop-yarn-api/target/hadoop-yarn-api-3.0.0-SNAPSHOT-test-sources.jar>
[INFO] 
[INFO] --- maven-enforcer-plugin:1.3.1:enforce (dist-enforce) @ hadoop-yarn-api ---
[INFO] 
[INFO] --- maven-site-plugin:3.5:attach-descriptor (attach-descriptor) @ hadoop-yarn-api ---
[INFO] 
[INFO] --- maven-javadoc-plugin:2.8.1:jar (module-javadocs) @ hadoop-yarn-api ---
[INFO] Skipping javadoc generation
[INFO] 
[INFO] --- maven-enforcer-plugin:1.3.1:enforce (depcheck) @ hadoop-yarn-api ---
Downloading: https://repository.apache.org/content/repositories/snapshots/org/apache/hadoop/hadoop-main/3.0.0-SNAPSHOT/hadoop-main-3.0.0-20160412.221408-7598.pom
4/25 KB        
8/25 KB   
8/25 KB   
12/25 KB   
16/25 KB   
20/25 KB   
23/25 KB   
24/25 KB   
25/25 KB   
           
Downloaded: https://repository.apache.org/content/repositories/snapshots/org/apache/hadoop/hadoop-main/3.0.0-SNAPSHOT/hadoop-main-3.0.0-20160412.221408-7598.pom
(25 KB at 129.9 KB/sec)
[WARNING] 
Dependency convergence error for org.apache.hadoop:hadoop-annotations:3.0.0-SNAPSHOT paths
to dependency are:
+-org.apache.hadoop:hadoop-yarn-api:3.0.0-SNAPSHOT
  +-org.apache.hadoop:hadoop-common:3.0.0-20160412.221507-7601
    +-org.apache.hadoop:hadoop-annotations:3.0.0-SNAPSHOT
and
+-org.apache.hadoop:hadoop-yarn-api:3.0.0-SNAPSHOT
  +-org.apache.hadoop:hadoop-annotations:3.0.0-20160412.221416-8508
and
+-org.apache.hadoop:hadoop-yarn-api:3.0.0-SNAPSHOT
  +-org.apache.hadoop:hadoop-common:3.0.0-20160412.221507-7601
    +-org.apache.hadoop:hadoop-annotations:3.0.0-SNAPSHOT

[WARNING] Rule 0: org.apache.maven.plugins.enforcer.DependencyConvergence failed with message:
Failed while enforcing releasability the error(s) are [
Dependency convergence error for org.apache.hadoop:hadoop-annotations:3.0.0-SNAPSHOT paths
to dependency are:
+-org.apache.hadoop:hadoop-yarn-api:3.0.0-SNAPSHOT
  +-org.apache.hadoop:hadoop-common:3.0.0-20160412.221507-7601
    +-org.apache.hadoop:hadoop-annotations:3.0.0-SNAPSHOT
and
+-org.apache.hadoop:hadoop-yarn-api:3.0.0-SNAPSHOT
  +-org.apache.hadoop:hadoop-annotations:3.0.0-20160412.221416-8508
and
+-org.apache.hadoop:hadoop-yarn-api:3.0.0-SNAPSHOT
  +-org.apache.hadoop:hadoop-common:3.0.0-20160412.221507-7601
    +-org.apache.hadoop:hadoop-annotations:3.0.0-SNAPSHOT
]
[INFO] ------------------------------------------------------------------------
[INFO] Reactor Summary:
[INFO] 
[INFO] Apache Hadoop YARN ................................ SUCCESS [  7.412 s]
[INFO] Apache Hadoop YARN API ............................ FAILURE [ 33.987 s]
[INFO] Apache Hadoop YARN Common ......................... SKIPPED
[INFO] Apache Hadoop YARN Server ......................... SKIPPED
[INFO] Apache Hadoop YARN Server Common .................. SKIPPED
[INFO] Apache Hadoop YARN NodeManager .................... SKIPPED
[INFO] Apache Hadoop YARN Web Proxy ...................... SKIPPED
[INFO] Apache Hadoop YARN ApplicationHistoryService ...... SKIPPED
[INFO] Apache Hadoop YARN ResourceManager ................ SKIPPED
[INFO] Apache Hadoop YARN Server Tests ................... SKIPPED
[INFO] Apache Hadoop YARN Client ......................... SKIPPED
[INFO] Apache Hadoop YARN SharedCacheManager ............. SKIPPED
[INFO] Apache Hadoop YARN Timeline Plugin Storage ........ SKIPPED
[INFO] Apache Hadoop YARN Applications ................... SKIPPED
[INFO] Apache Hadoop YARN DistributedShell ............... SKIPPED
[INFO] Apache Hadoop YARN Unmanaged Am Launcher .......... SKIPPED
[INFO] Apache Hadoop YARN Site ........................... SKIPPED
[INFO] Apache Hadoop YARN Registry ....................... SKIPPED
[INFO] Apache Hadoop YARN Project ........................ SKIPPED
[INFO] ------------------------------------------------------------------------
[INFO] BUILD FAILURE
[INFO] ------------------------------------------------------------------------
[INFO] Total time: 44.299 s
[INFO] Finished at: 2016-04-12T22:16:28+00:00
[INFO] Final Memory: 52M/293M
[INFO] ------------------------------------------------------------------------
[ERROR] Failed to execute goal org.apache.maven.plugins:maven-enforcer-plugin:1.3.1:enforce
(depcheck) on project hadoop-yarn-api: Some Enforcer rules have failed. Look above for specific
messages explaining why the rule failed. -> [Help 1]
[ERROR] 
[ERROR] To see the full stack trace of the errors, re-run Maven with the -e switch.
[ERROR] Re-run Maven using the -X switch to enable full debug logging.
[ERROR] 
[ERROR] For more information about the errors and possible solutions, please read the following
articles:
[ERROR] [Help 1] http://cwiki.apache.org/confluence/display/MAVEN/MojoExecutionException
[ERROR] 
[ERROR] After correcting the problems, you can resume the build with the command
[ERROR]   mvn <goals> -rf :hadoop-yarn-api
Build step 'Execute shell' marked build as failure
Archiving artifacts
Recording test results

Mime
View raw message