hadoop-yarn-dev mailing list archives

Site index · List index
Message view « Date » · « Thread »
Top « Date » · « Thread »
From Apache Jenkins Server <jenk...@builds.apache.org>
Subject Hadoop-Yarn-trunk-Java8 - Build # 1363 - Still Failing
Date Wed, 27 Apr 2016 18:32:16 GMT
See https://builds.apache.org/job/Hadoop-Yarn-trunk-Java8/1363/

###################################################################################
########################## LAST 60 LINES OF THE CONSOLE ###########################
[...truncated 5441 lines...]
Java HotSpot(TM) 64-Bit Server VM warning: ignoring option MaxPermSize=768m; support was removed
in 8.0
Running org.apache.hadoop.yarn.webapp.TestRMWithCSRFFilter
Tests run: 4, Failures: 0, Errors: 0, Skipped: 0, Time elapsed: 9.225 sec - in org.apache.hadoop.yarn.webapp.TestRMWithCSRFFilter

Results :

Failed tests: 
  TestContainerResizing.testIncreaseContainerUnreservedWhenApplicationCompleted:812->checkPendingResource:1062
expected:<0> but was:<1024>

Tests in error: 
  TestAMRestart.testAMRestartNotLostContainerCompleteMsg:966 ยป  test timed out a...

Tests run: 1354, Failures: 1, Errors: 1, Skipped: 3

[INFO] ------------------------------------------------------------------------
[INFO] Reactor Summary:
[INFO] 
[INFO] Apache Hadoop YARN ................................ SUCCESS [  6.486 s]
[INFO] Apache Hadoop YARN API ............................ SUCCESS [02:08 min]
[INFO] Apache Hadoop YARN Common ......................... SUCCESS [03:45 min]
[INFO] Apache Hadoop YARN Server ......................... SUCCESS [  0.092 s]
[INFO] Apache Hadoop YARN Server Common .................. SUCCESS [ 53.988 s]
[INFO] Apache Hadoop YARN NodeManager .................... SUCCESS [14:23 min]
[INFO] Apache Hadoop YARN Web Proxy ...................... SUCCESS [ 28.965 s]
[INFO] Apache Hadoop YARN ApplicationHistoryService ...... SUCCESS [04:40 min]
[INFO] Apache Hadoop YARN ResourceManager ................ FAILURE [  01:26 h]
[INFO] Apache Hadoop YARN Server Tests ................... SKIPPED
[INFO] Apache Hadoop YARN Client ......................... SKIPPED
[INFO] Apache Hadoop YARN SharedCacheManager ............. SKIPPED
[INFO] Apache Hadoop YARN Timeline Plugin Storage ........ SKIPPED
[INFO] Apache Hadoop YARN Applications ................... SKIPPED
[INFO] Apache Hadoop YARN DistributedShell ............... SKIPPED
[INFO] Apache Hadoop YARN Unmanaged Am Launcher .......... SKIPPED
[INFO] Apache Hadoop YARN Site ........................... SKIPPED
[INFO] Apache Hadoop YARN Registry ....................... SKIPPED
[INFO] Apache Hadoop YARN Project ........................ SKIPPED
[INFO] ------------------------------------------------------------------------
[INFO] BUILD FAILURE
[INFO] ------------------------------------------------------------------------
[INFO] Total time: 01:52 h
[INFO] Finished at: 2016-04-27T18:32:12+00:00
[INFO] Final Memory: 65M/957M
[INFO] ------------------------------------------------------------------------
[ERROR] Failed to execute goal org.apache.maven.plugins:maven-surefire-plugin:2.17:test (default-test)
on project hadoop-yarn-server-resourcemanager: There was a timeout or other error in the fork
-> [Help 1]
[ERROR] 
[ERROR] To see the full stack trace of the errors, re-run Maven with the -e switch.
[ERROR] Re-run Maven using the -X switch to enable full debug logging.
[ERROR] 
[ERROR] For more information about the errors and possible solutions, please read the following
articles:
[ERROR] [Help 1] http://cwiki.apache.org/confluence/display/MAVEN/MojoFailureException
[ERROR] 
[ERROR] After correcting the problems, you can resume the build with the command
[ERROR]   mvn <goals> -rf :hadoop-yarn-server-resourcemanager
Build step 'Execute shell' marked build as failure
Archiving artifacts
Recording test results
Sending e-mails to: yarn-dev@hadoop.apache.org
Email was triggered for: Failure - Any
Sending email for trigger: Failure - Any



###################################################################################
############################## FAILED TESTS (if any) ##############################
2 tests failed.
FAILED:  org.apache.hadoop.yarn.server.resourcemanager.applicationsmanager.TestAMRestart.testAMRestartNotLostContainerCompleteMsg

Error Message:
test timed out after 30000 milliseconds

Stack Trace:
java.lang.Exception: test timed out after 30000 milliseconds
	at java.lang.Thread.sleep(Native Method)
	at org.apache.hadoop.yarn.server.resourcemanager.MockRM.waitForState(MockRM.java:316)
	at org.apache.hadoop.yarn.server.resourcemanager.MockRM.waitForState(MockRM.java:301)
	at org.apache.hadoop.yarn.server.resourcemanager.MockRM.waitForState(MockRM.java:296)
	at org.apache.hadoop.yarn.server.resourcemanager.applicationsmanager.TestAMRestart.testAMRestartNotLostContainerCompleteMsg(TestAMRestart.java:966)


FAILED:  org.apache.hadoop.yarn.server.resourcemanager.scheduler.capacity.TestContainerResizing.testIncreaseContainerUnreservedWhenApplicationCompleted

Error Message:
expected:<0> but was:<1024>

Stack Trace:
java.lang.AssertionError: expected:<0> but was:<1024>
	at org.junit.Assert.fail(Assert.java:88)
	at org.junit.Assert.failNotEquals(Assert.java:743)
	at org.junit.Assert.assertEquals(Assert.java:118)
	at org.junit.Assert.assertEquals(Assert.java:555)
	at org.junit.Assert.assertEquals(Assert.java:542)
	at org.apache.hadoop.yarn.server.resourcemanager.scheduler.capacity.TestContainerResizing.checkPendingResource(TestContainerResizing.java:1062)
	at org.apache.hadoop.yarn.server.resourcemanager.scheduler.capacity.TestContainerResizing.testIncreaseContainerUnreservedWhenApplicationCompleted(TestContainerResizing.java:812)



Mime
  • Unnamed multipart/mixed (inline, None, 0 bytes)
View raw message