hadoop-yarn-dev mailing list archives

Site index · List index
Message view « Date » · « Thread »
Top « Date » · « Thread »
From Apache Jenkins Server <jenk...@builds.apache.org>
Subject Build failed in Jenkins: Hadoop-Yarn-trunk #1919
Date Thu, 24 Mar 2016 17:47:39 GMT
See <https://builds.apache.org/job/Hadoop-Yarn-trunk/1919/changes>

Changes:

[aw] YARN-4850. test-fair-scheduler.xml isn't valid xml (Yufei Gu via aw)

------------------------------------------
[...truncated 10610 lines...]

[INFO] 
[INFO] --- maven-jar-plugin:2.5:jar (default-jar) @ hadoop-yarn-server-tests ---
[INFO] Building jar: <https://builds.apache.org/job/Hadoop-Yarn-trunk/ws/hadoop-yarn-project/hadoop-yarn/hadoop-yarn-server/hadoop-yarn-server-tests/target/hadoop-yarn-server-tests-3.0.0-SNAPSHOT.jar>
[INFO] 
[INFO] --- maven-source-plugin:2.3:jar-no-fork (hadoop-java-sources) @ hadoop-yarn-server-tests
---
[INFO] Building jar: <https://builds.apache.org/job/Hadoop-Yarn-trunk/ws/hadoop-yarn-project/hadoop-yarn/hadoop-yarn-server/hadoop-yarn-server-tests/target/hadoop-yarn-server-tests-3.0.0-SNAPSHOT-sources.jar>
[INFO] 
[INFO] --- maven-source-plugin:2.3:test-jar-no-fork (hadoop-java-sources) @ hadoop-yarn-server-tests
---
[INFO] Building jar: <https://builds.apache.org/job/Hadoop-Yarn-trunk/ws/hadoop-yarn-project/hadoop-yarn/hadoop-yarn-server/hadoop-yarn-server-tests/target/hadoop-yarn-server-tests-3.0.0-SNAPSHOT-test-sources.jar>
[INFO] 
[INFO] --- maven-enforcer-plugin:1.3.1:enforce (dist-enforce) @ hadoop-yarn-server-tests ---
[INFO] 
[INFO] --- maven-site-plugin:3.5:attach-descriptor (attach-descriptor) @ hadoop-yarn-server-tests
---
[INFO] 
[INFO] --- maven-javadoc-plugin:2.8.1:jar (module-javadocs) @ hadoop-yarn-server-tests ---
[INFO] 
Loading source files for package org.apache.hadoop.yarn.proto...
Constructing Javadoc information...
Standard Doclet version 1.7.0_55
Building tree for all the packages and classes...
Generating <https://builds.apache.org/job/Hadoop-Yarn-trunk/ws/hadoop-yarn-project/hadoop-yarn/hadoop-yarn-server/hadoop-yarn-server-tests/target/org/apache/hadoop/yarn/proto/YarnSecurityTestTokenProtos.html...>
Generating <https://builds.apache.org/job/Hadoop-Yarn-trunk/ws/hadoop-yarn-project/hadoop-yarn/hadoop-yarn-server/hadoop-yarn-server-tests/target/org/apache/hadoop/yarn/proto/YarnSecurityTestTokenProtos.ContainerTokenIdentifierForTestProto.html...>
Generating <https://builds.apache.org/job/Hadoop-Yarn-trunk/ws/hadoop-yarn-project/hadoop-yarn/hadoop-yarn-server/hadoop-yarn-server-tests/target/org/apache/hadoop/yarn/proto/YarnSecurityTestTokenProtos.ContainerTokenIdentifierForTestProto.Builder.html...>
Generating <https://builds.apache.org/job/Hadoop-Yarn-trunk/ws/hadoop-yarn-project/hadoop-yarn/hadoop-yarn-server/hadoop-yarn-server-tests/target/org/apache/hadoop/yarn/proto/YarnSecurityTestTokenProtos.ContainerTokenIdentifierForTestProtoOrBuilder.html...>
Generating <https://builds.apache.org/job/Hadoop-Yarn-trunk/ws/hadoop-yarn-project/hadoop-yarn/hadoop-yarn-server/hadoop-yarn-server-tests/target/org/apache/hadoop/yarn/proto/YarnSecurityTestTokenProtos.NMTokenIdentifierNewProto.html...>
Generating <https://builds.apache.org/job/Hadoop-Yarn-trunk/ws/hadoop-yarn-project/hadoop-yarn/hadoop-yarn-server/hadoop-yarn-server-tests/target/org/apache/hadoop/yarn/proto/YarnSecurityTestTokenProtos.NMTokenIdentifierNewProto.Builder.html...>
Generating <https://builds.apache.org/job/Hadoop-Yarn-trunk/ws/hadoop-yarn-project/hadoop-yarn/hadoop-yarn-server/hadoop-yarn-server-tests/target/org/apache/hadoop/yarn/proto/YarnSecurityTestTokenProtos.NMTokenIdentifierNewProtoOrBuilder.html...>
Generating <https://builds.apache.org/job/Hadoop-Yarn-trunk/ws/hadoop-yarn-project/hadoop-yarn/hadoop-yarn-server/hadoop-yarn-server-tests/target/org/apache/hadoop/yarn/proto/package-frame.html...>
Generating <https://builds.apache.org/job/Hadoop-Yarn-trunk/ws/hadoop-yarn-project/hadoop-yarn/hadoop-yarn-server/hadoop-yarn-server-tests/target/org/apache/hadoop/yarn/proto/package-summary.html...>
Generating <https://builds.apache.org/job/Hadoop-Yarn-trunk/ws/hadoop-yarn-project/hadoop-yarn/hadoop-yarn-server/hadoop-yarn-server-tests/target/org/apache/hadoop/yarn/proto/package-tree.html...>
Generating <https://builds.apache.org/job/Hadoop-Yarn-trunk/ws/hadoop-yarn-project/hadoop-yarn/hadoop-yarn-server/hadoop-yarn-server-tests/target/constant-values.html...>
Generating <https://builds.apache.org/job/Hadoop-Yarn-trunk/ws/hadoop-yarn-project/hadoop-yarn/hadoop-yarn-server/hadoop-yarn-server-tests/target/serialized-form.html...>
Generating <https://builds.apache.org/job/Hadoop-Yarn-trunk/ws/hadoop-yarn-project/hadoop-yarn/hadoop-yarn-server/hadoop-yarn-server-tests/target/org/apache/hadoop/yarn/proto/class-use/YarnSecurityTestTokenProtos.html...>
Generating <https://builds.apache.org/job/Hadoop-Yarn-trunk/ws/hadoop-yarn-project/hadoop-yarn/hadoop-yarn-server/hadoop-yarn-server-tests/target/org/apache/hadoop/yarn/proto/class-use/YarnSecurityTestTokenProtos.NMTokenIdentifierNewProtoOrBuilder.html...>
Generating <https://builds.apache.org/job/Hadoop-Yarn-trunk/ws/hadoop-yarn-project/hadoop-yarn/hadoop-yarn-server/hadoop-yarn-server-tests/target/org/apache/hadoop/yarn/proto/class-use/YarnSecurityTestTokenProtos.NMTokenIdentifierNewProto.html...>
Generating <https://builds.apache.org/job/Hadoop-Yarn-trunk/ws/hadoop-yarn-project/hadoop-yarn/hadoop-yarn-server/hadoop-yarn-server-tests/target/org/apache/hadoop/yarn/proto/class-use/YarnSecurityTestTokenProtos.NMTokenIdentifierNewProto.Builder.html...>
Generating <https://builds.apache.org/job/Hadoop-Yarn-trunk/ws/hadoop-yarn-project/hadoop-yarn/hadoop-yarn-server/hadoop-yarn-server-tests/target/org/apache/hadoop/yarn/proto/class-use/YarnSecurityTestTokenProtos.ContainerTokenIdentifierForTestProtoOrBuilder.html...>
Generating <https://builds.apache.org/job/Hadoop-Yarn-trunk/ws/hadoop-yarn-project/hadoop-yarn/hadoop-yarn-server/hadoop-yarn-server-tests/target/org/apache/hadoop/yarn/proto/class-use/YarnSecurityTestTokenProtos.ContainerTokenIdentifierForTestProto.html...>
Generating <https://builds.apache.org/job/Hadoop-Yarn-trunk/ws/hadoop-yarn-project/hadoop-yarn/hadoop-yarn-server/hadoop-yarn-server-tests/target/org/apache/hadoop/yarn/proto/class-use/YarnSecurityTestTokenProtos.ContainerTokenIdentifierForTestProto.Builder.html...>
Generating <https://builds.apache.org/job/Hadoop-Yarn-trunk/ws/hadoop-yarn-project/hadoop-yarn/hadoop-yarn-server/hadoop-yarn-server-tests/target/org/apache/hadoop/yarn/proto/package-use.html...>
Building index for all the packages and classes...
Generating <https://builds.apache.org/job/Hadoop-Yarn-trunk/ws/hadoop-yarn-project/hadoop-yarn/hadoop-yarn-server/hadoop-yarn-server-tests/target/overview-tree.html...>
Generating <https://builds.apache.org/job/Hadoop-Yarn-trunk/ws/hadoop-yarn-project/hadoop-yarn/hadoop-yarn-server/hadoop-yarn-server-tests/target/index-all.html...>
Generating <https://builds.apache.org/job/Hadoop-Yarn-trunk/ws/hadoop-yarn-project/hadoop-yarn/hadoop-yarn-server/hadoop-yarn-server-tests/target/deprecated-list.html...>
Building index for all classes...
Generating <https://builds.apache.org/job/Hadoop-Yarn-trunk/ws/hadoop-yarn-project/hadoop-yarn/hadoop-yarn-server/hadoop-yarn-server-tests/target/allclasses-frame.html...>
Generating <https://builds.apache.org/job/Hadoop-Yarn-trunk/ws/hadoop-yarn-project/hadoop-yarn/hadoop-yarn-server/hadoop-yarn-server-tests/target/allclasses-noframe.html...>
Generating <https://builds.apache.org/job/Hadoop-Yarn-trunk/ws/hadoop-yarn-project/hadoop-yarn/hadoop-yarn-server/hadoop-yarn-server-tests/target/index.html...>
Generating <https://builds.apache.org/job/Hadoop-Yarn-trunk/ws/hadoop-yarn-project/hadoop-yarn/hadoop-yarn-server/hadoop-yarn-server-tests/target/help-doc.html...>
[INFO] Building jar: <https://builds.apache.org/job/Hadoop-Yarn-trunk/ws/hadoop-yarn-project/hadoop-yarn/hadoop-yarn-server/hadoop-yarn-server-tests/target/hadoop-yarn-server-tests-3.0.0-SNAPSHOT-javadoc.jar>
[INFO] 
[INFO] --- maven-enforcer-plugin:1.3.1:enforce (depcheck) @ hadoop-yarn-server-tests ---
[INFO] 
[INFO] --- maven-checkstyle-plugin:2.15:checkstyle (default-cli) @ hadoop-yarn-server-tests
---
[INFO] There are 767 errors reported by Checkstyle 6.6 with checkstyle/checkstyle.xml ruleset.
[WARNING] Unable to locate Source XRef to link to - DISABLED
[INFO] 
[INFO] --- findbugs-maven-plugin:3.0.0:findbugs (default-cli) @ hadoop-yarn-server-tests ---
[INFO] Fork Value is true
[INFO] Done FindBugs Analysis....
[INFO]                                                                         
[INFO] ------------------------------------------------------------------------
[INFO] Building Apache Hadoop YARN Client 3.0.0-SNAPSHOT
[INFO] ------------------------------------------------------------------------
[INFO] 
[INFO] --- maven-clean-plugin:2.5:clean (default-clean) @ hadoop-yarn-client ---
[INFO] Deleting <https://builds.apache.org/job/Hadoop-Yarn-trunk/ws/hadoop-yarn-project/hadoop-yarn/hadoop-yarn-client/target>
[INFO] 
[INFO] --- maven-antrun-plugin:1.7:run (create-testdirs) @ hadoop-yarn-client ---
[INFO] Executing tasks

main:
    [mkdir] Created dir: <https://builds.apache.org/job/Hadoop-Yarn-trunk/ws/hadoop-yarn-project/hadoop-yarn/hadoop-yarn-client/target/test-dir>
[INFO] Executed tasks
[INFO] 
[INFO] --- hadoop-maven-plugins:3.0.0-SNAPSHOT:protoc (compile-protoc) @ hadoop-yarn-client
---
[INFO] Wrote protoc checksums to file <https://builds.apache.org/job/Hadoop-Yarn-trunk/ws/hadoop-yarn-project/hadoop-yarn/hadoop-yarn-client/target/hadoop-maven-plugins-protoc-checksums.json>
[INFO] 
[INFO] --- maven-resources-plugin:2.6:resources (default-resources) @ hadoop-yarn-client ---
[INFO] Using 'UTF-8' encoding to copy filtered resources.
[INFO] skip non existing resourceDirectory <https://builds.apache.org/job/Hadoop-Yarn-trunk/ws/hadoop-yarn-project/hadoop-yarn/hadoop-yarn-client/src/main/resources>
[INFO] 
[INFO] --- maven-compiler-plugin:3.1:compile (default-compile) @ hadoop-yarn-client ---
[INFO] Compiling 35 source files to <https://builds.apache.org/job/Hadoop-Yarn-trunk/ws/hadoop-yarn-project/hadoop-yarn/hadoop-yarn-client/target/classes>
[INFO] 
[INFO] --- maven-resources-plugin:2.6:testResources (default-testResources) @ hadoop-yarn-client
---
[INFO] Using 'UTF-8' encoding to copy filtered resources.
[INFO] Copying 6 resources
[INFO] 
[INFO] --- maven-compiler-plugin:3.1:testCompile (default-testCompile) @ hadoop-yarn-client
---
[INFO] Compiling 25 source files to <https://builds.apache.org/job/Hadoop-Yarn-trunk/ws/hadoop-yarn-project/hadoop-yarn/hadoop-yarn-client/target/test-classes>
[WARNING] <https://builds.apache.org/job/Hadoop-Yarn-trunk/ws/hadoop-yarn-project/hadoop-yarn/hadoop-yarn-client/src/test/java/org/apache/hadoop/yarn/client/ProtocolHATestBase.java>:
<https://builds.apache.org/job/Hadoop-Yarn-trunk/ws/hadoop-yarn-project/hadoop-yarn/hadoop-yarn-client/src/test/java/org/apache/hadoop/yarn/client/ProtocolHATestBase.java>
uses or overrides a deprecated API.
[WARNING] <https://builds.apache.org/job/Hadoop-Yarn-trunk/ws/hadoop-yarn-project/hadoop-yarn/hadoop-yarn-client/src/test/java/org/apache/hadoop/yarn/client/ProtocolHATestBase.java>:
Recompile with -Xlint:deprecation for details.
[INFO] 
[INFO] --- maven-surefire-plugin:2.17:test (default-test) @ hadoop-yarn-client ---
[INFO] Surefire report directory: <https://builds.apache.org/job/Hadoop-Yarn-trunk/ws/hadoop-yarn-project/hadoop-yarn/hadoop-yarn-client/target/surefire-reports>

-------------------------------------------------------
 T E S T S
-------------------------------------------------------

-------------------------------------------------------
 T E S T S
-------------------------------------------------------
Running org.apache.hadoop.yarn.client.TestApplicationClientProtocolOnHA
Tests run: 17, Failures: 0, Errors: 0, Skipped: 0, Time elapsed: 73.529 sec - in org.apache.hadoop.yarn.client.TestApplicationClientProtocolOnHA
Running org.apache.hadoop.yarn.client.TestResourceTrackerOnHA
Tests run: 1, Failures: 0, Errors: 0, Skipped: 0, Time elapsed: 8.958 sec - in org.apache.hadoop.yarn.client.TestResourceTrackerOnHA
Running org.apache.hadoop.yarn.client.TestHedgingRequestRMFailoverProxyProvider
Tests run: 1, Failures: 0, Errors: 0, Skipped: 0, Time elapsed: 8.057 sec - in org.apache.hadoop.yarn.client.TestHedgingRequestRMFailoverProxyProvider
Running org.apache.hadoop.yarn.client.util.TestYarnClientUtils
Tests run: 5, Failures: 0, Errors: 0, Skipped: 0, Time elapsed: 1.453 sec - in org.apache.hadoop.yarn.client.util.TestYarnClientUtils
Running org.apache.hadoop.yarn.client.api.impl.TestSharedCacheClientImpl
Tests run: 6, Failures: 0, Errors: 0, Skipped: 0, Time elapsed: 1.383 sec - in org.apache.hadoop.yarn.client.api.impl.TestSharedCacheClientImpl
Running org.apache.hadoop.yarn.client.api.impl.TestNMClient
Tests run: 2, Failures: 0, Errors: 0, Skipped: 0, Time elapsed: 77.576 sec - in org.apache.hadoop.yarn.client.api.impl.TestNMClient
Running org.apache.hadoop.yarn.client.api.impl.TestAMRMClient
Tests run: 11, Failures: 0, Errors: 0, Skipped: 0, Time elapsed: 78.973 sec - in org.apache.hadoop.yarn.client.api.impl.TestAMRMClient
Running org.apache.hadoop.yarn.client.api.impl.TestYarnClient
Tests run: 22, Failures: 1, Errors: 0, Skipped: 0, Time elapsed: 22.538 sec <<< FAILURE!
- in org.apache.hadoop.yarn.client.api.impl.TestYarnClient
testReservationAPIs(org.apache.hadoop.yarn.client.api.impl.TestYarnClient)  Time elapsed:
3.373 sec  <<< FAILURE!
java.lang.AssertionError: org.apache.hadoop.yarn.server.resourcemanager.reservation.exceptions.PlanningException:
The request cannot be satisfied
	at org.apache.hadoop.yarn.ipc.RPCUtil.getRemoteException(RPCUtil.java:38)
	at org.apache.hadoop.yarn.server.resourcemanager.ClientRMService.submitReservation(ClientRMService.java:1254)
	at org.apache.hadoop.yarn.api.impl.pb.service.ApplicationClientProtocolPBServiceImpl.submitReservation(ApplicationClientProtocolPBServiceImpl.java:457)
	at org.apache.hadoop.yarn.proto.ApplicationClientProtocol$ApplicationClientProtocolService$2.callBlockingMethod(ApplicationClientProtocol.java:515)
	at org.apache.hadoop.ipc.ProtobufRpcEngine$Server$ProtoBufRpcInvoker.call(ProtobufRpcEngine.java:637)
	at org.apache.hadoop.ipc.RPC$Server.call(RPC.java:989)
	at org.apache.hadoop.ipc.Server$Handler$1.run(Server.java:2360)
	at org.apache.hadoop.ipc.Server$Handler$1.run(Server.java:2356)
	at java.security.AccessController.doPrivileged(Native Method)
	at javax.security.auth.Subject.doAs(Subject.java:415)
	at org.apache.hadoop.security.UserGroupInformation.doAs(UserGroupInformation.java:1742)
	at org.apache.hadoop.ipc.Server$Handler.run(Server.java:2354)
Caused by: org.apache.hadoop.yarn.server.resourcemanager.reservation.exceptions.PlanningException:
The request cannot be satisfied
	at org.apache.hadoop.yarn.server.resourcemanager.reservation.planning.IterativePlanner.computeJobAllocation(IterativePlanner.java:151)
	at org.apache.hadoop.yarn.server.resourcemanager.reservation.planning.PlanningAlgorithm.allocateUser(PlanningAlgorithm.java:64)
	at org.apache.hadoop.yarn.server.resourcemanager.reservation.planning.PlanningAlgorithm.createReservation(PlanningAlgorithm.java:140)
	at org.apache.hadoop.yarn.server.resourcemanager.reservation.planning.TryManyReservationAgents.createReservation(TryManyReservationAgents.java:55)
	at org.apache.hadoop.yarn.server.resourcemanager.reservation.planning.AlignedPlannerWithGreedy.createReservation(AlignedPlannerWithGreedy.java:84)
	at org.apache.hadoop.yarn.server.resourcemanager.ClientRMService.submitReservation(ClientRMService.java:1237)
	... 10 more

	at org.junit.Assert.fail(Assert.java:88)
	at org.apache.hadoop.yarn.client.api.impl.TestYarnClient.testReservationAPIs(TestYarnClient.java:1227)

Running org.apache.hadoop.yarn.client.api.impl.TestAHSClient
Tests run: 7, Failures: 0, Errors: 0, Skipped: 0, Time elapsed: 1.893 sec - in org.apache.hadoop.yarn.client.api.impl.TestAHSClient
Running org.apache.hadoop.yarn.client.api.impl.TestAMRMClientOnRMRestart
Tests run: 3, Failures: 0, Errors: 0, Skipped: 0, Time elapsed: 30.451 sec - in org.apache.hadoop.yarn.client.api.impl.TestAMRMClientOnRMRestart
Running org.apache.hadoop.yarn.client.api.impl.TestAMRMClientContainerRequest
Tests run: 5, Failures: 0, Errors: 0, Skipped: 0, Time elapsed: 1.001 sec - in org.apache.hadoop.yarn.client.api.impl.TestAMRMClientContainerRequest
Running org.apache.hadoop.yarn.client.api.async.impl.TestNMClientAsync
Tests run: 2, Failures: 0, Errors: 0, Skipped: 0, Time elapsed: 1.143 sec - in org.apache.hadoop.yarn.client.api.async.impl.TestNMClientAsync
Running org.apache.hadoop.yarn.client.api.async.impl.TestAMRMClientAsync
Tests run: 9, Failures: 0, Errors: 0, Skipped: 0, Time elapsed: 3.062 sec - in org.apache.hadoop.yarn.client.api.async.impl.TestAMRMClientAsync
Running org.apache.hadoop.yarn.client.TestApplicationMasterServiceProtocolOnHA
Tests run: 3, Failures: 0, Errors: 0, Skipped: 0, Time elapsed: 15.055 sec - in org.apache.hadoop.yarn.client.TestApplicationMasterServiceProtocolOnHA
Running org.apache.hadoop.yarn.client.TestGetGroups
Tests run: 6, Failures: 0, Errors: 0, Skipped: 0, Time elapsed: 5.503 sec - in org.apache.hadoop.yarn.client.TestGetGroups
Running org.apache.hadoop.yarn.client.TestYarnApiClasses
Tests run: 3, Failures: 0, Errors: 0, Skipped: 0, Time elapsed: 0.425 sec - in org.apache.hadoop.yarn.client.TestYarnApiClasses
Running org.apache.hadoop.yarn.client.TestResourceManagerAdministrationProtocolPBClientImpl
Tests run: 7, Failures: 0, Errors: 0, Skipped: 0, Time elapsed: 5.452 sec - in org.apache.hadoop.yarn.client.TestResourceManagerAdministrationProtocolPBClientImpl
Running org.apache.hadoop.yarn.client.TestRMFailover
Tests run: 5, Failures: 0, Errors: 0, Skipped: 0, Time elapsed: 28.793 sec - in org.apache.hadoop.yarn.client.TestRMFailover
Running org.apache.hadoop.yarn.client.cli.TestClusterCLI
Tests run: 4, Failures: 0, Errors: 0, Skipped: 0, Time elapsed: 1.673 sec - in org.apache.hadoop.yarn.client.cli.TestClusterCLI
Running org.apache.hadoop.yarn.client.cli.TestLogsCLI
Tests run: 6, Failures: 0, Errors: 0, Skipped: 0, Time elapsed: 1.68 sec - in org.apache.hadoop.yarn.client.cli.TestLogsCLI
Running org.apache.hadoop.yarn.client.cli.TestYarnCLI
Tests run: 33, Failures: 0, Errors: 0, Skipped: 0, Time elapsed: 9.042 sec - in org.apache.hadoop.yarn.client.cli.TestYarnCLI
Running org.apache.hadoop.yarn.client.cli.TestRMAdminCLI
Tests run: 26, Failures: 0, Errors: 0, Skipped: 0, Time elapsed: 4.668 sec - in org.apache.hadoop.yarn.client.cli.TestRMAdminCLI

Results :

Failed tests: 
  TestYarnClient.testReservationAPIs:1227 org.apache.hadoop.yarn.server.resourcemanager.reservation.exceptions.PlanningException:
The request cannot be satisfied
	at org.apache.hadoop.yarn.ipc.RPCUtil.getRemoteException(RPCUtil.java:38)
	at org.apache.hadoop.yarn.server.resourcemanager.ClientRMService.submitReservation(ClientRMService.java:1254)
	at org.apache.hadoop.yarn.api.impl.pb.service.ApplicationClientProtocolPBServiceImpl.submitReservation(ApplicationClientProtocolPBServiceImpl.java:457)
	at org.apache.hadoop.yarn.proto.ApplicationClientProtocol$ApplicationClientProtocolService$2.callBlockingMethod(ApplicationClientProtocol.java:515)
	at org.apache.hadoop.ipc.ProtobufRpcEngine$Server$ProtoBufRpcInvoker.call(ProtobufRpcEngine.java:637)
	at org.apache.hadoop.ipc.RPC$Server.call(RPC.java:989)
	at org.apache.hadoop.ipc.Server$Handler$1.run(Server.java:2360)
	at org.apache.hadoop.ipc.Server$Handler$1.run(Server.java:2356)
	at java.security.AccessController.doPrivileged(Native Method)
	at javax.security.auth.Subject.doAs(Subject.java:415)
	at org.apache.hadoop.security.UserGroupInformation.doAs(UserGroupInformation.java:1742)
	at org.apache.hadoop.ipc.Server$Handler.run(Server.java:2354)
Caused by: org.apache.hadoop.yarn.server.resourcemanager.reservation.exceptions.PlanningException:
The request cannot be satisfied
	at org.apache.hadoop.yarn.server.resourcemanager.reservation.planning.IterativePlanner.computeJobAllocation(IterativePlanner.java:151)
	at org.apache.hadoop.yarn.server.resourcemanager.reservation.planning.PlanningAlgorithm.allocateUser(PlanningAlgorithm.java:64)
	at org.apache.hadoop.yarn.server.resourcemanager.reservation.planning.PlanningAlgorithm.createReservation(PlanningAlgorithm.java:140)
	at org.apache.hadoop.yarn.server.resourcemanager.reservation.planning.TryManyReservationAgents.createReservation(TryManyReservationAgents.java:55)
	at org.apache.hadoop.yarn.server.resourcemanager.reservation.planning.AlignedPlannerWithGreedy.createReservation(AlignedPlannerWithGreedy.java:84)
	at org.apache.hadoop.yarn.server.resourcemanager.ClientRMService.submitReservation(ClientRMService.java:1237)
	... 10 more


Tests run: 184, Failures: 1, Errors: 0, Skipped: 0

[INFO] ------------------------------------------------------------------------
[INFO] Reactor Summary:
[INFO] 
[INFO] Apache Hadoop YARN ................................ SUCCESS [  3.481 s]
[INFO] Apache Hadoop YARN API ............................ SUCCESS [04:25 min]
[INFO] Apache Hadoop YARN Common ......................... SUCCESS [03:09 min]
[INFO] Apache Hadoop YARN Server ......................... SUCCESS [  0.090 s]
[INFO] Apache Hadoop YARN Server Common .................. SUCCESS [ 48.881 s]
[INFO] Apache Hadoop YARN NodeManager .................... SUCCESS [10:19 min]
[INFO] Apache Hadoop YARN Web Proxy ...................... SUCCESS [ 26.563 s]
[INFO] Apache Hadoop YARN ApplicationHistoryService ...... SUCCESS [03:31 min]
[INFO] Apache Hadoop YARN ResourceManager ................ SUCCESS [  01:11 h]
[INFO] Apache Hadoop YARN Server Tests ................... SUCCESS [02:27 min]
[INFO] Apache Hadoop YARN Client ......................... FAILURE [06:31 min]
[INFO] Apache Hadoop YARN SharedCacheManager ............. SKIPPED
[INFO] Apache Hadoop YARN Timeline Plugin Storage ........ SKIPPED
[INFO] Apache Hadoop YARN Applications ................... SKIPPED
[INFO] Apache Hadoop YARN DistributedShell ............... SKIPPED
[INFO] Apache Hadoop YARN Unmanaged Am Launcher .......... SKIPPED
[INFO] Apache Hadoop YARN Site ........................... SKIPPED
[INFO] Apache Hadoop YARN Registry ....................... SKIPPED
[INFO] Apache Hadoop YARN Project ........................ SKIPPED
[INFO] ------------------------------------------------------------------------
[INFO] BUILD FAILURE
[INFO] ------------------------------------------------------------------------
[INFO] Total time: 01:43 h
[INFO] Finished at: 2016-03-24T17:47:36+00:00
[INFO] Final Memory: 71M/700M
[INFO] ------------------------------------------------------------------------
[ERROR] Failed to execute goal org.apache.maven.plugins:maven-surefire-plugin:2.17:test (default-test)
on project hadoop-yarn-client: There are test failures.
[ERROR] 
[ERROR] Please refer to <https://builds.apache.org/job/Hadoop-Yarn-trunk/ws/hadoop-yarn-project/hadoop-yarn/hadoop-yarn-client/target/surefire-reports>
for the individual test results.
[ERROR] -> [Help 1]
[ERROR] 
[ERROR] To see the full stack trace of the errors, re-run Maven with the -e switch.
[ERROR] Re-run Maven using the -X switch to enable full debug logging.
[ERROR] 
[ERROR] For more information about the errors and possible solutions, please read the following
articles:
[ERROR] [Help 1] http://cwiki.apache.org/confluence/display/MAVEN/MojoFailureException
[ERROR] 
[ERROR] After correcting the problems, you can resume the build with the command
[ERROR]   mvn <goals> -rf :hadoop-yarn-client
Build step 'Execute shell' marked build as failure
Archiving artifacts
Recording test results

Mime
View raw message