hadoop-yarn-dev mailing list archives

Site index · List index
Message view « Date » · « Thread »
Top « Date » · « Thread »
From Apache Jenkins Server <jenk...@builds.apache.org>
Subject Hadoop-Yarn-trunk - Build # 1921 - Failure
Date Fri, 25 Mar 2016 08:59:11 GMT
See https://builds.apache.org/job/Hadoop-Yarn-trunk/1921/

###################################################################################
########################## LAST 60 LINES OF THE CONSOLE ###########################
[...truncated 7613 lines...]
Tests run: 5, Failures: 0, Errors: 0, Skipped: 0, Time elapsed: 1.571 sec - in org.apache.hadoop.yarn.server.nodemanager.util.TestCgroupsLCEResourcesHandler
Running org.apache.hadoop.yarn.server.nodemanager.util.TestNodeManagerHardwareUtils
Tests run: 3, Failures: 0, Errors: 0, Skipped: 0, Time elapsed: 1.025 sec - in org.apache.hadoop.yarn.server.nodemanager.util.TestNodeManagerHardwareUtils
Running org.apache.hadoop.yarn.server.nodemanager.util.TestProcessIdFileReader
Tests run: 3, Failures: 0, Errors: 0, Skipped: 0, Time elapsed: 0.253 sec - in org.apache.hadoop.yarn.server.nodemanager.util.TestProcessIdFileReader
Running org.apache.hadoop.yarn.server.nodemanager.TestNodeStatusUpdaterForLabels
Tests run: 2, Failures: 0, Errors: 0, Skipped: 0, Time elapsed: 10.071 sec - in org.apache.hadoop.yarn.server.nodemanager.TestNodeStatusUpdaterForLabels
Running org.apache.hadoop.yarn.server.nodemanager.api.protocolrecords.impl.pb.TestPBLocalizerRPC
Tests run: 1, Failures: 0, Errors: 0, Skipped: 0, Time elapsed: 1.315 sec - in org.apache.hadoop.yarn.server.nodemanager.api.protocolrecords.impl.pb.TestPBLocalizerRPC
Running org.apache.hadoop.yarn.server.nodemanager.api.protocolrecords.impl.pb.TestPBRecordImpl
Tests run: 4, Failures: 0, Errors: 0, Skipped: 0, Time elapsed: 0.695 sec - in org.apache.hadoop.yarn.server.nodemanager.api.protocolrecords.impl.pb.TestPBRecordImpl
Running org.apache.hadoop.yarn.server.nodemanager.TestNodeStatusUpdater
Slave went offline during the build
ERROR: Connection was broken: java.io.IOException: Sorry, this connection is closed.
	at com.trilead.ssh2.transport.TransportManager.ensureConnected(TransportManager.java:587)
	at com.trilead.ssh2.transport.TransportManager.sendMessage(TransportManager.java:660)
	at com.trilead.ssh2.channel.Channel.freeupWindow(Channel.java:407)
	at com.trilead.ssh2.channel.Channel.freeupWindow(Channel.java:347)
	at com.trilead.ssh2.channel.ChannelManager.getChannelData(ChannelManager.java:943)
	at com.trilead.ssh2.channel.ChannelInputStream.read(ChannelInputStream.java:58)
	at com.trilead.ssh2.channel.ChannelInputStream.read(ChannelInputStream.java:79)
	at hudson.remoting.FlightRecorderInputStream.read(FlightRecorderInputStream.java:82)
	at hudson.remoting.ChunkedInputStream.readHeader(ChunkedInputStream.java:72)
	at hudson.remoting.ChunkedInputStream.readUntilBreak(ChunkedInputStream.java:103)
	at hudson.remoting.ChunkedCommandTransport.readBlock(ChunkedCommandTransport.java:39)
	at hudson.remoting.AbstractSynchronousByteArrayCommandTransport.read(AbstractSynchronousByteArrayCommandTransport.java:34)
	at hudson.remoting.SynchronousCommandTransport$ReaderThread.run(SynchronousCommandTransport.java:48)
Caused by: java.io.IOException: Error: the peer is not consuming our asynchronous replies.
	at com.trilead.ssh2.transport.TransportManager.sendAsynchronousMessage(TransportManager.java:628)
	at com.trilead.ssh2.channel.Channel.freeupWindow(Channel.java:405)
	at com.trilead.ssh2.channel.Channel$Output.write(Channel.java:99)
	at com.trilead.ssh2.channel.ChannelManager.msgChannelExtendedData(ChannelManager.java:848)
	at com.trilead.ssh2.channel.ChannelManager.handleMessage(ChannelManager.java:1463)
	at com.trilead.ssh2.transport.TransportManager.receiveLoop(TransportManager.java:796)
	at com.trilead.ssh2.transport.TransportManager$1.run(TransportManager.java:489)
	at java.lang.Thread.run(Thread.java:745)

Build step 'Execute shell' marked build as failure
ERROR: Step ?Archive the artifacts? failed: no workspace for Hadoop-Yarn-trunk #1921
ERROR: Step ?Publish JUnit test result report? failed: no workspace for Hadoop-Yarn-trunk
#1921
ERROR: Build step failed with exception
java.lang.NullPointerException
	at hudson.plugins.violations.ViolationsPublisher.perform(ViolationsPublisher.java:74)
	at hudson.tasks.BuildStepMonitor$3.perform(BuildStepMonitor.java:45)
	at hudson.model.AbstractBuild$AbstractBuildExecution.perform(AbstractBuild.java:782)
	at hudson.model.AbstractBuild$AbstractBuildExecution.performAllBuildSteps(AbstractBuild.java:723)
	at hudson.model.Build$BuildExecution.post2(Build.java:185)
	at hudson.model.AbstractBuild$AbstractBuildExecution.post(AbstractBuild.java:668)
	at hudson.model.Run.execute(Run.java:1763)
	at hudson.model.FreeStyleBuild.run(FreeStyleBuild.java:43)
	at hudson.model.ResourceController.execute(ResourceController.java:98)
	at hudson.model.Executor.run(Executor.java:410)
Build step 'Report Violations' marked build as failure
ERROR: Step ?E-mail Notification? failed: no workspace for Hadoop-Yarn-trunk #1921
Email was triggered for: Failure - Any
Sending email for trigger: Failure - Any
ERROR: H4 is offline; cannot locate JDK 1.7 (latest)
ERROR: H4 is offline; cannot locate JDK 1.7 (latest)




###################################################################################
############################## FAILED TESTS (if any) ##############################
No tests ran.
Mime
  • Unnamed multipart/mixed (inline, None, 0 bytes)
View raw message