hadoop-yarn-dev mailing list archives

Site index · List index
Message view « Date » · « Thread »
Top « Date » · « Thread »
From Apache Jenkins Server <jenk...@builds.apache.org>
Subject Hadoop-Yarn-trunk - Build # 1915 - Still Failing
Date Wed, 23 Mar 2016 17:11:06 GMT
See https://builds.apache.org/job/Hadoop-Yarn-trunk/1915/

###################################################################################
########################## LAST 60 LINES OF THE CONSOLE ###########################
[...truncated 7802 lines...]
Tests run: 8, Failures: 0, Errors: 0, Skipped: 0, Time elapsed: 1.415 sec - in org.apache.hadoop.yarn.server.nodemanager.TestLinuxContainerExecutorWithMocks

Results :

Tests in error: 
  TestContainerManagerRecovery>BaseContainerManagerTest.tearDown:263->BaseContainerManagerTest.createContainerExecutor:152
» Runtime
  TestContainerManagerRecovery.<init>:112->BaseContainerManagerTest.<init>:93
» UnsupportedFileSystem
  TestContainerManagerRecovery.<init>:112->BaseContainerManagerTest.<init>:93
» UnsupportedFileSystem

Tests run: 427, Failures: 0, Errors: 3, Skipped: 17

[INFO] ------------------------------------------------------------------------
[INFO] Reactor Summary:
[INFO] 
[INFO] Apache Hadoop YARN ................................ SUCCESS [  3.540 s]
[INFO] Apache Hadoop YARN API ............................ SUCCESS [04:24 min]
[INFO] Apache Hadoop YARN Common ......................... SUCCESS [03:06 min]
[INFO] Apache Hadoop YARN Server ......................... SUCCESS [  0.092 s]
[INFO] Apache Hadoop YARN Server Common .................. SUCCESS [ 47.651 s]
[INFO] Apache Hadoop YARN NodeManager .................... FAILURE [08:51 min]
[INFO] Apache Hadoop YARN Web Proxy ...................... SKIPPED
[INFO] Apache Hadoop YARN ApplicationHistoryService ...... SKIPPED
[INFO] Apache Hadoop YARN ResourceManager ................ SKIPPED
[INFO] Apache Hadoop YARN Server Tests ................... SKIPPED
[INFO] Apache Hadoop YARN Client ......................... SKIPPED
[INFO] Apache Hadoop YARN SharedCacheManager ............. SKIPPED
[INFO] Apache Hadoop YARN Timeline Plugin Storage ........ SKIPPED
[INFO] Apache Hadoop YARN Applications ................... SKIPPED
[INFO] Apache Hadoop YARN DistributedShell ............... SKIPPED
[INFO] Apache Hadoop YARN Unmanaged Am Launcher .......... SKIPPED
[INFO] Apache Hadoop YARN Site ........................... SKIPPED
[INFO] Apache Hadoop YARN Registry ....................... SKIPPED
[INFO] Apache Hadoop YARN Project ........................ SKIPPED
[INFO] ------------------------------------------------------------------------
[INFO] BUILD FAILURE
[INFO] ------------------------------------------------------------------------
[INFO] Total time: 17:14 min
[INFO] Finished at: 2016-03-23T17:11:03+00:00
[INFO] Final Memory: 77M/911M
[INFO] ------------------------------------------------------------------------
[ERROR] Failed to execute goal org.apache.maven.plugins:maven-surefire-plugin:2.17:test (default-test)
on project hadoop-yarn-server-nodemanager: There are test failures.
[ERROR] 
[ERROR] Please refer to /home/jenkins/jenkins-slave/workspace/Hadoop-Yarn-trunk/hadoop-yarn-project/hadoop-yarn/hadoop-yarn-server/hadoop-yarn-server-nodemanager/target/surefire-reports
for the individual test results.
[ERROR] -> [Help 1]
[ERROR] 
[ERROR] To see the full stack trace of the errors, re-run Maven with the -e switch.
[ERROR] Re-run Maven using the -X switch to enable full debug logging.
[ERROR] 
[ERROR] For more information about the errors and possible solutions, please read the following
articles:
[ERROR] [Help 1] http://cwiki.apache.org/confluence/display/MAVEN/MojoFailureException
[ERROR] 
[ERROR] After correcting the problems, you can resume the build with the command
[ERROR]   mvn <goals> -rf :hadoop-yarn-server-nodemanager
Build step 'Execute shell' marked build as failure
Archiving artifacts
Recording test results
Sending e-mails to: yarn-dev@hadoop.apache.org
Email was triggered for: Failure - Any
Sending email for trigger: Failure - Any



###################################################################################
############################## FAILED TESTS (if any) ##############################
3 tests failed.
FAILED:  org.apache.hadoop.yarn.server.nodemanager.containermanager.TestContainerManagerRecovery.testApplicationRecovery

Error Message:
org.apache.hadoop.fs.UnsupportedFileSystemException: fs.AbstractFileSystem.file.impl=null:
No AbstractFileSystem configured for scheme: file

Stack Trace:
java.lang.RuntimeException: org.apache.hadoop.fs.UnsupportedFileSystemException: fs.AbstractFileSystem.file.impl=null:
No AbstractFileSystem configured for scheme: file
	at org.apache.hadoop.yarn.server.nodemanager.DefaultContainerExecutor.<init>(DefaultContainerExecutor.java:83)
	at org.apache.hadoop.yarn.server.nodemanager.containermanager.BaseContainerManagerTest.createContainerExecutor(BaseContainerManagerTest.java:152)
	at org.apache.hadoop.yarn.server.nodemanager.containermanager.BaseContainerManagerTest.tearDown(BaseContainerManagerTest.java:263)
	at sun.reflect.NativeMethodAccessorImpl.invoke0(Native Method)
	at sun.reflect.NativeMethodAccessorImpl.invoke(NativeMethodAccessorImpl.java:57)
	at sun.reflect.DelegatingMethodAccessorImpl.invoke(DelegatingMethodAccessorImpl.java:43)
	at java.lang.reflect.Method.invoke(Method.java:606)
	at org.junit.runners.model.FrameworkMethod$1.runReflectiveCall(FrameworkMethod.java:47)
	at org.junit.internal.runners.model.ReflectiveCallable.run(ReflectiveCallable.java:12)
	at org.junit.runners.model.FrameworkMethod.invokeExplosively(FrameworkMethod.java:44)
	at org.junit.internal.runners.statements.RunAfters.evaluate(RunAfters.java:33)
	at org.junit.runners.ParentRunner.runLeaf(ParentRunner.java:271)
	at org.junit.runners.BlockJUnit4ClassRunner.runChild(BlockJUnit4ClassRunner.java:70)
	at org.junit.runners.BlockJUnit4ClassRunner.runChild(BlockJUnit4ClassRunner.java:50)
	at org.junit.runners.ParentRunner$3.run(ParentRunner.java:238)
	at org.junit.runners.ParentRunner$1.schedule(ParentRunner.java:63)
	at org.junit.runners.ParentRunner.runChildren(ParentRunner.java:236)
	at org.junit.runners.ParentRunner.access$000(ParentRunner.java:53)
	at org.junit.runners.ParentRunner$2.evaluate(ParentRunner.java:229)
	at org.junit.runners.ParentRunner.run(ParentRunner.java:309)
	at org.apache.maven.surefire.junit4.JUnit4Provider.execute(JUnit4Provider.java:264)
	at org.apache.maven.surefire.junit4.JUnit4Provider.executeTestSet(JUnit4Provider.java:153)
	at org.apache.maven.surefire.junit4.JUnit4Provider.invoke(JUnit4Provider.java:124)
	at org.apache.maven.surefire.booter.ForkedBooter.invokeProviderInSameClassLoader(ForkedBooter.java:200)
	at org.apache.maven.surefire.booter.ForkedBooter.runSuitesInProcess(ForkedBooter.java:153)
	at org.apache.maven.surefire.booter.ForkedBooter.main(ForkedBooter.java:103)
Caused by: org.apache.hadoop.fs.UnsupportedFileSystemException: fs.AbstractFileSystem.file.impl=null:
No AbstractFileSystem configured for scheme: file
	at org.apache.hadoop.fs.AbstractFileSystem.createFileSystem(AbstractFileSystem.java:161)
	at org.apache.hadoop.fs.AbstractFileSystem.get(AbstractFileSystem.java:250)
	at org.apache.hadoop.fs.FileContext$2.run(FileContext.java:332)
	at org.apache.hadoop.fs.FileContext$2.run(FileContext.java:329)
	at java.security.AccessController.doPrivileged(Native Method)
	at javax.security.auth.Subject.doAs(Subject.java:415)
	at org.apache.hadoop.security.UserGroupInformation.doAs(UserGroupInformation.java:1742)
	at org.apache.hadoop.fs.FileContext.getAbstractFileSystem(FileContext.java:329)
	at org.apache.hadoop.fs.FileContext.getFileContext(FileContext.java:446)
	at org.apache.hadoop.fs.FileContext.getFileContext(FileContext.java:423)
	at org.apache.hadoop.fs.FileContext.getLocalFSFileContext(FileContext.java:409)
	at org.apache.hadoop.yarn.server.nodemanager.DefaultContainerExecutor.<init>(DefaultContainerExecutor.java:81)
	at org.apache.hadoop.yarn.server.nodemanager.containermanager.BaseContainerManagerTest.createContainerExecutor(BaseContainerManagerTest.java:152)
	at org.apache.hadoop.yarn.server.nodemanager.containermanager.BaseContainerManagerTest.tearDown(BaseContainerManagerTest.java:263)
	at sun.reflect.NativeMethodAccessorImpl.invoke0(Native Method)
	at sun.reflect.NativeMethodAccessorImpl.invoke(NativeMethodAccessorImpl.java:57)
	at sun.reflect.DelegatingMethodAccessorImpl.invoke(DelegatingMethodAccessorImpl.java:43)
	at java.lang.reflect.Method.invoke(Method.java:606)
	at org.junit.runners.model.FrameworkMethod$1.runReflectiveCall(FrameworkMethod.java:47)
	at org.junit.internal.runners.model.ReflectiveCallable.run(ReflectiveCallable.java:12)
	at org.junit.runners.model.FrameworkMethod.invokeExplosively(FrameworkMethod.java:44)
	at org.junit.internal.runners.statements.RunAfters.evaluate(RunAfters.java:33)
	at org.junit.runners.ParentRunner.runLeaf(ParentRunner.java:271)
	at org.junit.runners.BlockJUnit4ClassRunner.runChild(BlockJUnit4ClassRunner.java:70)
	at org.junit.runners.BlockJUnit4ClassRunner.runChild(BlockJUnit4ClassRunner.java:50)
	at org.junit.runners.ParentRunner$3.run(ParentRunner.java:238)
	at org.junit.runners.ParentRunner$1.schedule(ParentRunner.java:63)
	at org.junit.runners.ParentRunner.runChildren(ParentRunner.java:236)
	at org.junit.runners.ParentRunner.access$000(ParentRunner.java:53)
	at org.junit.runners.ParentRunner$2.evaluate(ParentRunner.java:229)
	at org.junit.runners.ParentRunner.run(ParentRunner.java:309)
	at org.apache.maven.surefire.junit4.JUnit4Provider.execute(JUnit4Provider.java:264)
	at org.apache.maven.surefire.junit4.JUnit4Provider.executeTestSet(JUnit4Provider.java:153)
	at org.apache.maven.surefire.junit4.JUnit4Provider.invoke(JUnit4Provider.java:124)
	at org.apache.maven.surefire.booter.ForkedBooter.invokeProviderInSameClassLoader(ForkedBooter.java:200)
	at org.apache.maven.surefire.booter.ForkedBooter.runSuitesInProcess(ForkedBooter.java:153)
	at org.apache.maven.surefire.booter.ForkedBooter.main(ForkedBooter.java:103)


FAILED:  org.apache.hadoop.yarn.server.nodemanager.containermanager.TestContainerManagerRecovery.testContainerCleanupOnShutdown

Error Message:
fs.AbstractFileSystem.file.impl=null: No AbstractFileSystem configured for scheme: file

Stack Trace:
org.apache.hadoop.fs.UnsupportedFileSystemException: fs.AbstractFileSystem.file.impl=null:
No AbstractFileSystem configured for scheme: file
	at org.apache.hadoop.fs.AbstractFileSystem.createFileSystem(AbstractFileSystem.java:161)
	at org.apache.hadoop.fs.AbstractFileSystem.get(AbstractFileSystem.java:250)
	at org.apache.hadoop.fs.FileContext$2.run(FileContext.java:332)
	at org.apache.hadoop.fs.FileContext$2.run(FileContext.java:329)
	at java.security.AccessController.doPrivileged(Native Method)
	at javax.security.auth.Subject.doAs(Subject.java:415)
	at org.apache.hadoop.security.UserGroupInformation.doAs(UserGroupInformation.java:1742)
	at org.apache.hadoop.fs.FileContext.getAbstractFileSystem(FileContext.java:329)
	at org.apache.hadoop.fs.FileContext.getFileContext(FileContext.java:446)
	at org.apache.hadoop.fs.FileContext.getFileContext(FileContext.java:423)
	at org.apache.hadoop.fs.FileContext.getLocalFSFileContext(FileContext.java:409)
	at org.apache.hadoop.yarn.server.nodemanager.containermanager.BaseContainerManagerTest.<init>(BaseContainerManagerTest.java:93)
	at org.apache.hadoop.yarn.server.nodemanager.containermanager.TestContainerManagerRecovery.<init>(TestContainerManagerRecovery.java:112)


FAILED:  org.apache.hadoop.yarn.server.nodemanager.containermanager.TestContainerManagerRecovery.testContainerResizeRecovery

Error Message:
fs.AbstractFileSystem.file.impl=null: No AbstractFileSystem configured for scheme: file

Stack Trace:
org.apache.hadoop.fs.UnsupportedFileSystemException: fs.AbstractFileSystem.file.impl=null:
No AbstractFileSystem configured for scheme: file
	at org.apache.hadoop.fs.AbstractFileSystem.createFileSystem(AbstractFileSystem.java:161)
	at org.apache.hadoop.fs.AbstractFileSystem.get(AbstractFileSystem.java:250)
	at org.apache.hadoop.fs.FileContext$2.run(FileContext.java:332)
	at org.apache.hadoop.fs.FileContext$2.run(FileContext.java:329)
	at java.security.AccessController.doPrivileged(Native Method)
	at javax.security.auth.Subject.doAs(Subject.java:415)
	at org.apache.hadoop.security.UserGroupInformation.doAs(UserGroupInformation.java:1742)
	at org.apache.hadoop.fs.FileContext.getAbstractFileSystem(FileContext.java:329)
	at org.apache.hadoop.fs.FileContext.getFileContext(FileContext.java:446)
	at org.apache.hadoop.fs.FileContext.getFileContext(FileContext.java:423)
	at org.apache.hadoop.fs.FileContext.getLocalFSFileContext(FileContext.java:409)
	at org.apache.hadoop.yarn.server.nodemanager.containermanager.BaseContainerManagerTest.<init>(BaseContainerManagerTest.java:93)
	at org.apache.hadoop.yarn.server.nodemanager.containermanager.TestContainerManagerRecovery.<init>(TestContainerManagerRecovery.java:112)



Mime
  • Unnamed multipart/mixed (inline, None, 0 bytes)
View raw message