hadoop-yarn-dev mailing list archives

Site index · List index
Message view « Date » · « Thread »
Top « Date » · « Thread »
From Apache Jenkins Server <jenk...@builds.apache.org>
Subject Hadoop-Yarn-trunk-Java8 - Build # 1165 - Failure
Date Tue, 08 Mar 2016 09:34:15 GMT
See https://builds.apache.org/job/Hadoop-Yarn-trunk-Java8/1165/

###################################################################################
########################## LAST 60 LINES OF THE CONSOLE ###########################
[...truncated 5344 lines...]
Java HotSpot(TM) 64-Bit Server VM warning: ignoring option MaxPermSize=768m; support was removed
in 8.0
Running org.apache.hadoop.yarn.server.TestMiniYarnClusterNodeUtilization
Tests run: 2, Failures: 0, Errors: 0, Skipped: 0, Time elapsed: 51.566 sec - in org.apache.hadoop.yarn.server.TestMiniYarnClusterNodeUtilization

Results :

Tests in error: 
  TestDiskFailures.testLocalDirsFailures:99->testDirsFailures:179->verifyDisksHealth:247
ยป NoSuchElement

Tests run: 11, Failures: 0, Errors: 1, Skipped: 0

[INFO] ------------------------------------------------------------------------
[INFO] Reactor Summary:
[INFO] 
[INFO] Apache Hadoop YARN ................................ SUCCESS [  7.635 s]
[INFO] Apache Hadoop YARN API ............................ SUCCESS [02:10 min]
[INFO] Apache Hadoop YARN Common ......................... SUCCESS [03:11 min]
[INFO] Apache Hadoop YARN Server ......................... SUCCESS [  0.058 s]
[INFO] Apache Hadoop YARN Server Common .................. SUCCESS [ 44.151 s]
[INFO] Apache Hadoop YARN NodeManager .................... SUCCESS [11:21 min]
[INFO] Apache Hadoop YARN Web Proxy ...................... SUCCESS [ 26.645 s]
[INFO] Apache Hadoop YARN ApplicationHistoryService ...... SUCCESS [04:42 min]
[INFO] Apache Hadoop YARN ResourceManager ................ SUCCESS [  01:20 h]
[INFO] Apache Hadoop YARN Server Tests ................... FAILURE [03:20 min]
[INFO] Apache Hadoop YARN Client ......................... SKIPPED
[INFO] Apache Hadoop YARN SharedCacheManager ............. SKIPPED
[INFO] Apache Hadoop YARN Timeline Plugin Storage ........ SKIPPED
[INFO] Apache Hadoop YARN Applications ................... SKIPPED
[INFO] Apache Hadoop YARN DistributedShell ............... SKIPPED
[INFO] Apache Hadoop YARN Unmanaged Am Launcher .......... SKIPPED
[INFO] Apache Hadoop YARN Site ........................... SKIPPED
[INFO] Apache Hadoop YARN Registry ....................... SKIPPED
[INFO] Apache Hadoop YARN Project ........................ SKIPPED
[INFO] ------------------------------------------------------------------------
[INFO] BUILD FAILURE
[INFO] ------------------------------------------------------------------------
[INFO] Total time: 01:46 h
[INFO] Finished at: 2016-03-08T09:34:07+00:00
[INFO] Final Memory: 82M/1145M
[INFO] ------------------------------------------------------------------------
[ERROR] Failed to execute goal org.apache.maven.plugins:maven-surefire-plugin:2.17:test (default-test)
on project hadoop-yarn-server-tests: There are test failures.
[ERROR] 
[ERROR] Please refer to /home/jenkins/jenkins-slave/workspace/Hadoop-Yarn-trunk-Java8/hadoop-yarn-project/hadoop-yarn/hadoop-yarn-server/hadoop-yarn-server-tests/target/surefire-reports
for the individual test results.
[ERROR] -> [Help 1]
[ERROR] 
[ERROR] To see the full stack trace of the errors, re-run Maven with the -e switch.
[ERROR] Re-run Maven using the -X switch to enable full debug logging.
[ERROR] 
[ERROR] For more information about the errors and possible solutions, please read the following
articles:
[ERROR] [Help 1] http://cwiki.apache.org/confluence/display/MAVEN/MojoFailureException
[ERROR] 
[ERROR] After correcting the problems, you can resume the build with the command
[ERROR]   mvn <goals> -rf :hadoop-yarn-server-tests
Build step 'Execute shell' marked build as failure
Archiving artifacts
Recording test results
Sending e-mails to: yarn-dev@hadoop.apache.org
Email was triggered for: Failure - Any
Sending email for trigger: Failure - Any



###################################################################################
############################## FAILED TESTS (if any) ##############################
1 tests failed.
FAILED:  org.apache.hadoop.yarn.server.TestDiskFailures.testLocalDirsFailures

Error Message:
null

Stack Trace:
java.util.NoSuchElementException: null
	at java.util.concurrent.ConcurrentHashMap$ValueIterator.next(ConcurrentHashMap.java:3436)
	at org.apache.hadoop.yarn.server.TestDiskFailures.verifyDisksHealth(TestDiskFailures.java:247)
	at org.apache.hadoop.yarn.server.TestDiskFailures.testDirsFailures(TestDiskFailures.java:179)
	at org.apache.hadoop.yarn.server.TestDiskFailures.testLocalDirsFailures(TestDiskFailures.java:99)



Mime
  • Unnamed multipart/mixed (inline, None, 0 bytes)
View raw message