hadoop-yarn-dev mailing list archives

Site index · List index
Message view « Date » · « Thread »
Top « Date » · « Thread »
From Apache Jenkins Server <jenk...@builds.apache.org>
Subject Build failed in Jenkins: Hadoop-Yarn-trunk-Java8 #1145
Date Thu, 03 Mar 2016 06:09:54 GMT
See <https://builds.apache.org/job/Hadoop-Yarn-trunk-Java8/1145/changes>

Changes:

[arp] HDFS-9534. Add CLI command to clear storage policy from a path.

------------------------------------------
[...truncated 5147 lines...]
Running org.apache.hadoop.yarn.server.resourcemanager.TestRMHAForNodeLabels
Tests run: 1, Failures: 0, Errors: 0, Skipped: 0, Time elapsed: 2.914 sec - in org.apache.hadoop.yarn.server.resourcemanager.TestRMHAForNodeLabels
Java HotSpot(TM) 64-Bit Server VM warning: ignoring option MaxPermSize=768m; support was removed
in 8.0
Running org.apache.hadoop.yarn.server.resourcemanager.TestApplicationMasterLauncher
Tests run: 4, Failures: 0, Errors: 0, Skipped: 0, Time elapsed: 20.557 sec - in org.apache.hadoop.yarn.server.resourcemanager.TestApplicationMasterLauncher
Java HotSpot(TM) 64-Bit Server VM warning: ignoring option MaxPermSize=768m; support was removed
in 8.0
Running org.apache.hadoop.yarn.server.resourcemanager.TestApplicationMasterService
Tests run: 8, Failures: 0, Errors: 0, Skipped: 0, Time elapsed: 50.204 sec - in org.apache.hadoop.yarn.server.resourcemanager.TestApplicationMasterService
Java HotSpot(TM) 64-Bit Server VM warning: ignoring option MaxPermSize=768m; support was removed
in 8.0
Running org.apache.hadoop.yarn.server.resourcemanager.TestApplicationACLs
Tests run: 1, Failures: 0, Errors: 0, Skipped: 0, Time elapsed: 8.36 sec - in org.apache.hadoop.yarn.server.resourcemanager.TestApplicationACLs
Java HotSpot(TM) 64-Bit Server VM warning: ignoring option MaxPermSize=768m; support was removed
in 8.0
Running org.apache.hadoop.yarn.server.resourcemanager.TestTokenClientRMService
Tests run: 6, Failures: 0, Errors: 0, Skipped: 0, Time elapsed: 1.337 sec - in org.apache.hadoop.yarn.server.resourcemanager.TestTokenClientRMService
Java HotSpot(TM) 64-Bit Server VM warning: ignoring option MaxPermSize=768m; support was removed
in 8.0
Running org.apache.hadoop.yarn.server.resourcemanager.recovery.TestZKRMStateStore
Tests run: 6, Failures: 0, Errors: 0, Skipped: 0, Time elapsed: 19.814 sec - in org.apache.hadoop.yarn.server.resourcemanager.recovery.TestZKRMStateStore
Java HotSpot(TM) 64-Bit Server VM warning: ignoring option MaxPermSize=768m; support was removed
in 8.0
Running org.apache.hadoop.yarn.server.resourcemanager.recovery.TestZKRMStateStoreZKClientConnections
Tests run: 4, Failures: 0, Errors: 0, Skipped: 0, Time elapsed: 8.569 sec - in org.apache.hadoop.yarn.server.resourcemanager.recovery.TestZKRMStateStoreZKClientConnections
Java HotSpot(TM) 64-Bit Server VM warning: ignoring option MaxPermSize=768m; support was removed
in 8.0
Running org.apache.hadoop.yarn.server.resourcemanager.recovery.TestFSRMStateStore
Tests run: 4, Failures: 0, Errors: 0, Skipped: 0, Time elapsed: 37.807 sec - in org.apache.hadoop.yarn.server.resourcemanager.recovery.TestFSRMStateStore
Java HotSpot(TM) 64-Bit Server VM warning: ignoring option MaxPermSize=768m; support was removed
in 8.0
Running org.apache.hadoop.yarn.server.resourcemanager.recovery.TestZKRMStateStorePerf
Tests run: 1, Failures: 0, Errors: 0, Skipped: 0, Time elapsed: 273.114 sec - in org.apache.hadoop.yarn.server.resourcemanager.recovery.TestZKRMStateStorePerf
Java HotSpot(TM) 64-Bit Server VM warning: ignoring option MaxPermSize=768m; support was removed
in 8.0
Running org.apache.hadoop.yarn.server.resourcemanager.recovery.TestLeveldbRMStateStore
Tests run: 10, Failures: 0, Errors: 0, Skipped: 0, Time elapsed: 8.589 sec - in org.apache.hadoop.yarn.server.resourcemanager.recovery.TestLeveldbRMStateStore
Java HotSpot(TM) 64-Bit Server VM warning: ignoring option MaxPermSize=768m; support was removed
in 8.0
Running org.apache.hadoop.yarn.server.resourcemanager.recovery.TestMemoryRMStateStore
Tests run: 1, Failures: 0, Errors: 0, Skipped: 0, Time elapsed: 0.67 sec - in org.apache.hadoop.yarn.server.resourcemanager.recovery.TestMemoryRMStateStore
Java HotSpot(TM) 64-Bit Server VM warning: ignoring option MaxPermSize=768m; support was removed
in 8.0
Running org.apache.hadoop.yarn.server.resourcemanager.recovery.TestProtos
Tests run: 1, Failures: 0, Errors: 0, Skipped: 0, Time elapsed: 0.187 sec - in org.apache.hadoop.yarn.server.resourcemanager.recovery.TestProtos
Java HotSpot(TM) 64-Bit Server VM warning: ignoring option MaxPermSize=768m; support was removed
in 8.0
Running org.apache.hadoop.yarn.server.resourcemanager.TestKillApplicationWithRMHA
Tests run: 4, Failures: 0, Errors: 0, Skipped: 0, Time elapsed: 24.801 sec - in org.apache.hadoop.yarn.server.resourcemanager.TestKillApplicationWithRMHA
Java HotSpot(TM) 64-Bit Server VM warning: ignoring option MaxPermSize=768m; support was removed
in 8.0
Running org.apache.hadoop.yarn.server.resourcemanager.monitor.TestSchedulingMonitor
Tests run: 1, Failures: 0, Errors: 0, Skipped: 0, Time elapsed: 1.395 sec - in org.apache.hadoop.yarn.server.resourcemanager.monitor.TestSchedulingMonitor
Java HotSpot(TM) 64-Bit Server VM warning: ignoring option MaxPermSize=768m; support was removed
in 8.0
Running org.apache.hadoop.yarn.server.resourcemanager.monitor.capacity.TestProportionalCapacityPreemptionPolicy
Tests run: 27, Failures: 0, Errors: 0, Skipped: 0, Time elapsed: 14.722 sec - in org.apache.hadoop.yarn.server.resourcemanager.monitor.capacity.TestProportionalCapacityPreemptionPolicy
Java HotSpot(TM) 64-Bit Server VM warning: ignoring option MaxPermSize=768m; support was removed
in 8.0
Running org.apache.hadoop.yarn.server.resourcemanager.monitor.capacity.TestProportionalCapacityPreemptionPolicyForNodePartitions
Tests run: 11, Failures: 0, Errors: 0, Skipped: 0, Time elapsed: 5.425 sec - in org.apache.hadoop.yarn.server.resourcemanager.monitor.capacity.TestProportionalCapacityPreemptionPolicyForNodePartitions
Java HotSpot(TM) 64-Bit Server VM warning: ignoring option MaxPermSize=768m; support was removed
in 8.0
Running org.apache.hadoop.yarn.server.resourcemanager.resourcetracker.TestNMReconnect
Tests run: 3, Failures: 0, Errors: 0, Skipped: 0, Time elapsed: 1.941 sec - in org.apache.hadoop.yarn.server.resourcemanager.resourcetracker.TestNMReconnect
Java HotSpot(TM) 64-Bit Server VM warning: ignoring option MaxPermSize=768m; support was removed
in 8.0
Running org.apache.hadoop.yarn.server.resourcemanager.resourcetracker.TestNMExpiry
Tests run: 1, Failures: 0, Errors: 0, Skipped: 0, Time elapsed: 2.863 sec - in org.apache.hadoop.yarn.server.resourcemanager.resourcetracker.TestNMExpiry
Java HotSpot(TM) 64-Bit Server VM warning: ignoring option MaxPermSize=768m; support was removed
in 8.0
Running org.apache.hadoop.yarn.server.resourcemanager.resourcetracker.TestRMNMRPCResponseId
Tests run: 1, Failures: 0, Errors: 0, Skipped: 0, Time elapsed: 1.181 sec - in org.apache.hadoop.yarn.server.resourcemanager.resourcetracker.TestRMNMRPCResponseId
Java HotSpot(TM) 64-Bit Server VM warning: ignoring option MaxPermSize=768m; support was removed
in 8.0
Running org.apache.hadoop.yarn.server.resourcemanager.TestLeaderElectorService
Tests run: 6, Failures: 0, Errors: 0, Skipped: 0, Time elapsed: 36.249 sec - in org.apache.hadoop.yarn.server.resourcemanager.TestLeaderElectorService
Java HotSpot(TM) 64-Bit Server VM warning: ignoring option MaxPermSize=768m; support was removed
in 8.0
Running org.apache.hadoop.yarn.server.resourcemanager.TestResourceManager
Tests run: 5, Failures: 0, Errors: 0, Skipped: 0, Time elapsed: 3.86 sec - in org.apache.hadoop.yarn.server.resourcemanager.TestResourceManager
Java HotSpot(TM) 64-Bit Server VM warning: ignoring option MaxPermSize=768m; support was removed
in 8.0
Running org.apache.hadoop.yarn.server.resourcemanager.TestRMNodeTransitions
Tests run: 33, Failures: 0, Errors: 0, Skipped: 0, Time elapsed: 1.688 sec - in org.apache.hadoop.yarn.server.resourcemanager.TestRMNodeTransitions
Java HotSpot(TM) 64-Bit Server VM warning: ignoring option MaxPermSize=768m; support was removed
in 8.0
Running org.apache.hadoop.yarn.server.resourcemanager.rmcontainer.TestRMContainerImpl
Tests run: 5, Failures: 0, Errors: 0, Skipped: 0, Time elapsed: 20.996 sec - in org.apache.hadoop.yarn.server.resourcemanager.rmcontainer.TestRMContainerImpl
Java HotSpot(TM) 64-Bit Server VM warning: ignoring option MaxPermSize=768m; support was removed
in 8.0
Running org.apache.hadoop.yarn.server.resourcemanager.TestRMProxyUsersConf
Tests run: 3, Failures: 0, Errors: 0, Skipped: 0, Time elapsed: 31.846 sec - in org.apache.hadoop.yarn.server.resourcemanager.TestRMProxyUsersConf
Java HotSpot(TM) 64-Bit Server VM warning: ignoring option MaxPermSize=768m; support was removed
in 8.0
Running org.apache.hadoop.yarn.server.resourcemanager.TestClusterMetrics
Tests run: 1, Failures: 0, Errors: 0, Skipped: 0, Time elapsed: 0.407 sec - in org.apache.hadoop.yarn.server.resourcemanager.TestClusterMetrics
Java HotSpot(TM) 64-Bit Server VM warning: ignoring option MaxPermSize=768m; support was removed
in 8.0
Running org.apache.hadoop.yarn.server.resourcemanager.resource.TestResourceWeights
Tests run: 1, Failures: 0, Errors: 0, Skipped: 0, Time elapsed: 0.068 sec - in org.apache.hadoop.yarn.server.resourcemanager.resource.TestResourceWeights
Java HotSpot(TM) 64-Bit Server VM warning: ignoring option MaxPermSize=768m; support was removed
in 8.0
Running org.apache.hadoop.yarn.server.resourcemanager.resource.TestResources
Tests run: 2, Failures: 0, Errors: 0, Skipped: 0, Time elapsed: 0.444 sec - in org.apache.hadoop.yarn.server.resourcemanager.resource.TestResources
Java HotSpot(TM) 64-Bit Server VM warning: ignoring option MaxPermSize=768m; support was removed
in 8.0
Running org.apache.hadoop.yarn.server.resourcemanager.TestApplicationCleanup
Tests run: 7, Failures: 0, Errors: 0, Skipped: 0, Time elapsed: 41.709 sec - in org.apache.hadoop.yarn.server.resourcemanager.TestApplicationCleanup
Java HotSpot(TM) 64-Bit Server VM warning: ignoring option MaxPermSize=768m; support was removed
in 8.0
Running org.apache.hadoop.yarn.server.resourcemanager.TestContainerResourceUsage
Tests run: 4, Failures: 0, Errors: 0, Skipped: 0, Time elapsed: 44.057 sec - in org.apache.hadoop.yarn.server.resourcemanager.TestContainerResourceUsage
Java HotSpot(TM) 64-Bit Server VM warning: ignoring option MaxPermSize=768m; support was removed
in 8.0
Running org.apache.hadoop.yarn.server.resourcemanager.TestRMEmbeddedElector
Tests run: 1, Failures: 0, Errors: 0, Skipped: 0, Time elapsed: 2.996 sec - in org.apache.hadoop.yarn.server.resourcemanager.TestRMEmbeddedElector
Java HotSpot(TM) 64-Bit Server VM warning: ignoring option MaxPermSize=768m; support was removed
in 8.0
Running org.apache.hadoop.yarn.server.resourcemanager.ahs.TestRMApplicationHistoryWriter
Tests run: 7, Failures: 0, Errors: 0, Skipped: 0, Time elapsed: 184.32 sec - in org.apache.hadoop.yarn.server.resourcemanager.ahs.TestRMApplicationHistoryWriter

Results :

Tests run: 1419, Failures: 0, Errors: 0, Skipped: 2

[INFO] 
[INFO] --- maven-jar-plugin:2.5:jar (default-jar) @ hadoop-yarn-server-resourcemanager ---
[INFO] Building jar: <https://builds.apache.org/job/Hadoop-Yarn-trunk-Java8/ws/hadoop-yarn-project/hadoop-yarn/hadoop-yarn-server/hadoop-yarn-server-resourcemanager/target/hadoop-yarn-server-resourcemanager-3.0.0-SNAPSHOT.jar>
[INFO] 
[INFO] --- maven-source-plugin:2.3:jar-no-fork (hadoop-java-sources) @ hadoop-yarn-server-resourcemanager
---
[INFO] Building jar: <https://builds.apache.org/job/Hadoop-Yarn-trunk-Java8/ws/hadoop-yarn-project/hadoop-yarn/hadoop-yarn-server/hadoop-yarn-server-resourcemanager/target/hadoop-yarn-server-resourcemanager-3.0.0-SNAPSHOT-sources.jar>
[INFO] 
[INFO] --- maven-source-plugin:2.3:test-jar-no-fork (hadoop-java-sources) @ hadoop-yarn-server-resourcemanager
---
[INFO] Building jar: <https://builds.apache.org/job/Hadoop-Yarn-trunk-Java8/ws/hadoop-yarn-project/hadoop-yarn/hadoop-yarn-server/hadoop-yarn-server-resourcemanager/target/hadoop-yarn-server-resourcemanager-3.0.0-SNAPSHOT-test-sources.jar>
[INFO] 
[INFO] --- maven-enforcer-plugin:1.3.1:enforce (dist-enforce) @ hadoop-yarn-server-resourcemanager
---
[INFO] 
[INFO] --- maven-site-plugin:3.4:attach-descriptor (attach-descriptor) @ hadoop-yarn-server-resourcemanager
---
[INFO] 
[INFO] --- maven-javadoc-plugin:2.8.1:jar (module-javadocs) @ hadoop-yarn-server-resourcemanager
---
[INFO] Skipping javadoc generation
[INFO] 
[INFO] --- maven-enforcer-plugin:1.3.1:enforce (depcheck) @ hadoop-yarn-server-resourcemanager
---
[INFO] 
[INFO] --- maven-checkstyle-plugin:2.15:checkstyle (default-cli) @ hadoop-yarn-server-resourcemanager
---
[INFO] There are 5272 errors reported by Checkstyle 6.6 with checkstyle/checkstyle.xml ruleset.
[WARNING] Unable to locate Source XRef to link to - DISABLED
[INFO] 
[INFO] --- findbugs-maven-plugin:3.0.0:findbugs (default-cli) @ hadoop-yarn-server-resourcemanager
---
[INFO] Fork Value is true
[INFO] Done FindBugs Analysis....
[INFO]                                                                         
[INFO] ------------------------------------------------------------------------
[INFO] Building Apache Hadoop YARN Server Tests 3.0.0-SNAPSHOT
[INFO] ------------------------------------------------------------------------
[INFO] 
[INFO] --- maven-clean-plugin:2.5:clean (default-clean) @ hadoop-yarn-server-tests ---
[INFO] Deleting <https://builds.apache.org/job/Hadoop-Yarn-trunk-Java8/ws/hadoop-yarn-project/hadoop-yarn/hadoop-yarn-server/hadoop-yarn-server-tests/target>
[INFO] 
[INFO] --- maven-antrun-plugin:1.7:run (create-testdirs) @ hadoop-yarn-server-tests ---
[INFO] Executing tasks

main:
    [mkdir] Created dir: <https://builds.apache.org/job/Hadoop-Yarn-trunk-Java8/ws/hadoop-yarn-project/hadoop-yarn/hadoop-yarn-server/hadoop-yarn-server-tests/target/test-dir>
[INFO] Executed tasks
[INFO] 
[INFO] --- hadoop-maven-plugins:3.0.0-SNAPSHOT:protoc (compile-protoc) @ hadoop-yarn-server-tests
---
[INFO] Wrote protoc checksums to file <https://builds.apache.org/job/Hadoop-Yarn-trunk-Java8/ws/hadoop-yarn-project/hadoop-yarn/hadoop-yarn-server/hadoop-yarn-server-tests/target/hadoop-maven-plugins-protoc-checksums.json>
[INFO] 
[INFO] --- maven-resources-plugin:2.6:resources (default-resources) @ hadoop-yarn-server-tests
---
[INFO] Using 'UTF-8' encoding to copy filtered resources.
[INFO] skip non existing resourceDirectory <https://builds.apache.org/job/Hadoop-Yarn-trunk-Java8/ws/hadoop-yarn-project/hadoop-yarn/hadoop-yarn-server/hadoop-yarn-server-tests/src/main/resources>
[INFO] 
[INFO] --- maven-compiler-plugin:3.1:compile (default-compile) @ hadoop-yarn-server-tests
---
[INFO] Compiling 1 source file to <https://builds.apache.org/job/Hadoop-Yarn-trunk-Java8/ws/hadoop-yarn-project/hadoop-yarn/hadoop-yarn-server/hadoop-yarn-server-tests/target/classes>
[INFO] 
[INFO] --- maven-resources-plugin:2.6:testResources (default-testResources) @ hadoop-yarn-server-tests
---
[INFO] Using 'UTF-8' encoding to copy filtered resources.
[INFO] Copying 4 resources
[INFO] 
[INFO] --- maven-compiler-plugin:3.1:testCompile (default-testCompile) @ hadoop-yarn-server-tests
---
[INFO] Compiling 9 source files to <https://builds.apache.org/job/Hadoop-Yarn-trunk-Java8/ws/hadoop-yarn-project/hadoop-yarn/hadoop-yarn-server/hadoop-yarn-server-tests/target/test-classes>
[WARNING] <https://builds.apache.org/job/Hadoop-Yarn-trunk-Java8/ws/hadoop-yarn-project/hadoop-yarn/hadoop-yarn-server/hadoop-yarn-server-tests/src/test/java/org/apache/hadoop/yarn/server/TestMiniYarnCluster.java>:
<https://builds.apache.org/job/Hadoop-Yarn-trunk-Java8/ws/hadoop-yarn-project/hadoop-yarn/hadoop-yarn-server/hadoop-yarn-server-tests/src/test/java/org/apache/hadoop/yarn/server/TestMiniYarnCluster.java>
uses or overrides a deprecated API.
[WARNING] <https://builds.apache.org/job/Hadoop-Yarn-trunk-Java8/ws/hadoop-yarn-project/hadoop-yarn/hadoop-yarn-server/hadoop-yarn-server-tests/src/test/java/org/apache/hadoop/yarn/server/TestMiniYarnCluster.java>:
Recompile with -Xlint:deprecation for details.
[INFO] 
[INFO] --- maven-jar-plugin:2.5:test-jar (default) @ hadoop-yarn-server-tests ---
[INFO] Building jar: <https://builds.apache.org/job/Hadoop-Yarn-trunk-Java8/ws/hadoop-yarn-project/hadoop-yarn/hadoop-yarn-server/hadoop-yarn-server-tests/target/hadoop-yarn-server-tests-3.0.0-SNAPSHOT-tests.jar>
[INFO] 
[INFO] --- maven-surefire-plugin:2.17:test (default-test) @ hadoop-yarn-server-tests ---
[INFO] Surefire report directory: <https://builds.apache.org/job/Hadoop-Yarn-trunk-Java8/ws/hadoop-yarn-project/hadoop-yarn/hadoop-yarn-server/hadoop-yarn-server-tests/target/surefire-reports>

-------------------------------------------------------
 T E S T S
-------------------------------------------------------

-------------------------------------------------------
 T E S T S
-------------------------------------------------------
Java HotSpot(TM) 64-Bit Server VM warning: ignoring option MaxPermSize=768m; support was removed
in 8.0
Running org.apache.hadoop.yarn.server.TestMiniYARNClusterForHA
Tests run: 1, Failures: 0, Errors: 0, Skipped: 0, Time elapsed: 5.949 sec - in org.apache.hadoop.yarn.server.TestMiniYARNClusterForHA
Java HotSpot(TM) 64-Bit Server VM warning: ignoring option MaxPermSize=768m; support was removed
in 8.0
Running org.apache.hadoop.yarn.server.TestMiniYarnClusterNodeUtilization
Tests run: 2, Failures: 0, Errors: 0, Skipped: 0, Time elapsed: 47.222 sec - in org.apache.hadoop.yarn.server.TestMiniYarnClusterNodeUtilization
Java HotSpot(TM) 64-Bit Server VM warning: ignoring option MaxPermSize=768m; support was removed
in 8.0
Running org.apache.hadoop.yarn.server.TestContainerManagerSecurity
Tests run: 2, Failures: 0, Errors: 0, Skipped: 0, Time elapsed: 72.866 sec - in org.apache.hadoop.yarn.server.TestContainerManagerSecurity
Java HotSpot(TM) 64-Bit Server VM warning: ignoring option MaxPermSize=768m; support was removed
in 8.0
Running org.apache.hadoop.yarn.server.TestRMNMSecretKeys
Tests run: 1, Failures: 0, Errors: 0, Skipped: 0, Time elapsed: 1.875 sec - in org.apache.hadoop.yarn.server.TestRMNMSecretKeys
Java HotSpot(TM) 64-Bit Server VM warning: ignoring option MaxPermSize=768m; support was removed
in 8.0
Running org.apache.hadoop.yarn.server.TestDiskFailures
Tests run: 3, Failures: 1, Errors: 0, Skipped: 0, Time elapsed: 18.723 sec <<< FAILURE!
- in org.apache.hadoop.yarn.server.TestDiskFailures
testLogDirsFailures(org.apache.hadoop.yarn.server.TestDiskFailures)  Time elapsed: 8.167 sec
 <<< FAILURE!
java.lang.AssertionError: NodeManager could not identify disk failure.
	at org.junit.Assert.fail(Assert.java:88)
	at org.junit.Assert.assertTrue(Assert.java:41)
	at org.apache.hadoop.yarn.server.TestDiskFailures.verifyDisksHealth(TestDiskFailures.java:239)
	at org.apache.hadoop.yarn.server.TestDiskFailures.testDirsFailures(TestDiskFailures.java:202)
	at org.apache.hadoop.yarn.server.TestDiskFailures.testLogDirsFailures(TestDiskFailures.java:111)

Java HotSpot(TM) 64-Bit Server VM warning: ignoring option MaxPermSize=768m; support was removed
in 8.0
Running org.apache.hadoop.yarn.server.TestMiniYarnCluster
Tests run: 2, Failures: 0, Errors: 0, Skipped: 0, Time elapsed: 13.859 sec - in org.apache.hadoop.yarn.server.TestMiniYarnCluster

Results :

Failed tests: 
  TestDiskFailures.testLogDirsFailures:111->testDirsFailures:202->verifyDisksHealth:239
NodeManager could not identify disk failure.

Tests run: 11, Failures: 1, Errors: 0, Skipped: 0

[INFO] ------------------------------------------------------------------------
[INFO] Reactor Summary:
[INFO] 
[INFO] Apache Hadoop YARN ................................ SUCCESS [  3.058 s]
[INFO] Apache Hadoop YARN API ............................ SUCCESS [01:32 min]
[INFO] Apache Hadoop YARN Common ......................... SUCCESS [02:33 min]
[INFO] Apache Hadoop YARN Server ......................... SUCCESS [  0.055 s]
[INFO] Apache Hadoop YARN Server Common .................. SUCCESS [ 37.517 s]
[INFO] Apache Hadoop YARN NodeManager .................... SUCCESS [10:20 min]
[INFO] Apache Hadoop YARN Web Proxy ...................... SUCCESS [ 17.470 s]
[INFO] Apache Hadoop YARN ApplicationHistoryService ...... SUCCESS [03:52 min]
[INFO] Apache Hadoop YARN ResourceManager ................ SUCCESS [  01:13 h]
[INFO] Apache Hadoop YARN Server Tests ................... FAILURE [02:43 min]
[INFO] Apache Hadoop YARN Client ......................... SKIPPED
[INFO] Apache Hadoop YARN SharedCacheManager ............. SKIPPED
[INFO] Apache Hadoop YARN Timeline Plugin Storage ........ SKIPPED
[INFO] Apache Hadoop YARN Applications ................... SKIPPED
[INFO] Apache Hadoop YARN DistributedShell ............... SKIPPED
[INFO] Apache Hadoop YARN Unmanaged Am Launcher .......... SKIPPED
[INFO] Apache Hadoop YARN Site ........................... SKIPPED
[INFO] Apache Hadoop YARN Registry ....................... SKIPPED
[INFO] Apache Hadoop YARN Project ........................ SKIPPED
[INFO] ------------------------------------------------------------------------
[INFO] BUILD FAILURE
[INFO] ------------------------------------------------------------------------
[INFO] Total time: 01:35 h
[INFO] Finished at: 2016-03-03T06:09:52+00:00
[INFO] Final Memory: 74M/800M
[INFO] ------------------------------------------------------------------------
[ERROR] Failed to execute goal org.apache.maven.plugins:maven-surefire-plugin:2.17:test (default-test)
on project hadoop-yarn-server-tests: There are test failures.
[ERROR] 
[ERROR] Please refer to <https://builds.apache.org/job/Hadoop-Yarn-trunk-Java8/ws/hadoop-yarn-project/hadoop-yarn/hadoop-yarn-server/hadoop-yarn-server-tests/target/surefire-reports>
for the individual test results.
[ERROR] -> [Help 1]
[ERROR] 
[ERROR] To see the full stack trace of the errors, re-run Maven with the -e switch.
[ERROR] Re-run Maven using the -X switch to enable full debug logging.
[ERROR] 
[ERROR] For more information about the errors and possible solutions, please read the following
articles:
[ERROR] [Help 1] http://cwiki.apache.org/confluence/display/MAVEN/MojoFailureException
[ERROR] 
[ERROR] After correcting the problems, you can resume the build with the command
[ERROR]   mvn <goals> -rf :hadoop-yarn-server-tests
Build step 'Execute shell' marked build as failure
Archiving artifacts
Recording test results

Mime
View raw message