hadoop-yarn-dev mailing list archives

Site index · List index
Message view « Date » · « Thread »
Top « Date » · « Thread »
From Apache Jenkins Server <jenk...@builds.apache.org>
Subject Build failed in Jenkins: Hadoop-Yarn-trunk #1895
Date Wed, 16 Mar 2016 03:38:00 GMT
See <https://builds.apache.org/job/Hadoop-Yarn-trunk/1895/changes>

Changes:

[wangda] MAPREDUCE-6579. JobStatus#getFailureInfo should not output diagnostic

------------------------------------------
[...truncated 5383 lines...]
Generating <https://builds.apache.org/job/Hadoop-Yarn-trunk/ws/hadoop-yarn-project/hadoop-yarn/hadoop-yarn-api/target/org/apache/hadoop/yarn/api/records/timeline/package-use.html...>
Generating <https://builds.apache.org/job/Hadoop-Yarn-trunk/ws/hadoop-yarn-project/hadoop-yarn/hadoop-yarn-api/target/org/apache/hadoop/yarn/conf/package-use.html...>
Generating <https://builds.apache.org/job/Hadoop-Yarn-trunk/ws/hadoop-yarn-project/hadoop-yarn/hadoop-yarn-api/target/org/apache/hadoop/yarn/exceptions/package-use.html...>
Generating <https://builds.apache.org/job/Hadoop-Yarn-trunk/ws/hadoop-yarn-project/hadoop-yarn/hadoop-yarn-api/target/org/apache/hadoop/yarn/factories/package-use.html...>
Generating <https://builds.apache.org/job/Hadoop-Yarn-trunk/ws/hadoop-yarn-project/hadoop-yarn/hadoop-yarn-api/target/org/apache/hadoop/yarn/factory/providers/package-use.html...>
Generating <https://builds.apache.org/job/Hadoop-Yarn-trunk/ws/hadoop-yarn-project/hadoop-yarn/hadoop-yarn-api/target/org/apache/hadoop/yarn/proto/package-use.html...>
Generating <https://builds.apache.org/job/Hadoop-Yarn-trunk/ws/hadoop-yarn-project/hadoop-yarn/hadoop-yarn-api/target/org/apache/hadoop/yarn/server/api/package-use.html...>
Generating <https://builds.apache.org/job/Hadoop-Yarn-trunk/ws/hadoop-yarn-project/hadoop-yarn/hadoop-yarn-api/target/org/apache/hadoop/yarn/server/api/protocolrecords/package-use.html...>
Generating <https://builds.apache.org/job/Hadoop-Yarn-trunk/ws/hadoop-yarn-project/hadoop-yarn/hadoop-yarn-api/target/org/apache/hadoop/yarn/util/package-use.html...>
Building index for all the packages and classes...
Generating <https://builds.apache.org/job/Hadoop-Yarn-trunk/ws/hadoop-yarn-project/hadoop-yarn/hadoop-yarn-api/target/overview-tree.html...>
Generating <https://builds.apache.org/job/Hadoop-Yarn-trunk/ws/hadoop-yarn-project/hadoop-yarn/hadoop-yarn-api/target/index-all.html...>
Generating <https://builds.apache.org/job/Hadoop-Yarn-trunk/ws/hadoop-yarn-project/hadoop-yarn/hadoop-yarn-api/target/deprecated-list.html...>
Building index for all classes...
Generating <https://builds.apache.org/job/Hadoop-Yarn-trunk/ws/hadoop-yarn-project/hadoop-yarn/hadoop-yarn-api/target/allclasses-frame.html...>
Generating <https://builds.apache.org/job/Hadoop-Yarn-trunk/ws/hadoop-yarn-project/hadoop-yarn/hadoop-yarn-api/target/allclasses-noframe.html...>
Generating <https://builds.apache.org/job/Hadoop-Yarn-trunk/ws/hadoop-yarn-project/hadoop-yarn/hadoop-yarn-api/target/index.html...>
Generating <https://builds.apache.org/job/Hadoop-Yarn-trunk/ws/hadoop-yarn-project/hadoop-yarn/hadoop-yarn-api/target/overview-summary.html...>
Generating <https://builds.apache.org/job/Hadoop-Yarn-trunk/ws/hadoop-yarn-project/hadoop-yarn/hadoop-yarn-api/target/help-doc.html...>
[INFO] Building jar: <https://builds.apache.org/job/Hadoop-Yarn-trunk/ws/hadoop-yarn-project/hadoop-yarn/hadoop-yarn-api/target/hadoop-yarn-api-3.0.0-SNAPSHOT-javadoc.jar>
[INFO] 
[INFO] --- maven-enforcer-plugin:1.3.1:enforce (depcheck) @ hadoop-yarn-api ---
[INFO] 
[INFO] --- maven-checkstyle-plugin:2.15:checkstyle (default-cli) @ hadoop-yarn-api ---
[INFO] There are 38013 errors reported by Checkstyle 6.6 with checkstyle/checkstyle.xml ruleset.
[WARNING] Unable to locate Source XRef to link to - DISABLED
[INFO] 
[INFO] --- findbugs-maven-plugin:3.0.0:findbugs (default-cli) @ hadoop-yarn-api ---
[INFO] Fork Value is true
[INFO] Done FindBugs Analysis....
[INFO]                                                                         
[INFO] ------------------------------------------------------------------------
[INFO] Building Apache Hadoop YARN Common 3.0.0-SNAPSHOT
[INFO] ------------------------------------------------------------------------
[INFO] 
[INFO] --- maven-clean-plugin:2.5:clean (default-clean) @ hadoop-yarn-common ---
[INFO] Deleting <https://builds.apache.org/job/Hadoop-Yarn-trunk/ws/hadoop-yarn-project/hadoop-yarn/hadoop-yarn-common/target>
[INFO] 
[INFO] --- maven-antrun-plugin:1.7:run (create-testdirs) @ hadoop-yarn-common ---
[INFO] Executing tasks

main:
    [mkdir] Created dir: <https://builds.apache.org/job/Hadoop-Yarn-trunk/ws/hadoop-yarn-project/hadoop-yarn/hadoop-yarn-common/target/test-dir>
[INFO] Executed tasks
[INFO] 
[INFO] --- hadoop-maven-plugins:3.0.0-SNAPSHOT:protoc (compile-protoc) @ hadoop-yarn-common
---
[INFO] Wrote protoc checksums to file <https://builds.apache.org/job/Hadoop-Yarn-trunk/ws/hadoop-yarn-project/hadoop-yarn/hadoop-yarn-common/target/hadoop-maven-plugins-protoc-checksums.json>
[INFO] 
[INFO] --- hadoop-maven-plugins:3.0.0-SNAPSHOT:version-info (version-info) @ hadoop-yarn-common
---
[WARNING] [svn, info] failed with error code 1
[INFO] SCM: GIT
[INFO] Computed MD5: 8b5b67e4e6569487cc40f9e5b93db45e
[INFO] 
[INFO] --- maven-resources-plugin:2.6:resources (default-resources) @ hadoop-yarn-common ---
[INFO] Using 'UTF-8' encoding to copy filtered resources.
[INFO] Copying 49 resources
[INFO] Copying 1 resource
[INFO] 
[INFO] --- maven-compiler-plugin:3.1:compile (default-compile) @ hadoop-yarn-common ---
[INFO] Compiling 354 source files to <https://builds.apache.org/job/Hadoop-Yarn-trunk/ws/hadoop-yarn-project/hadoop-yarn/hadoop-yarn-common/target/classes>
[INFO] 
[INFO] --- maven-resources-plugin:2.6:testResources (default-testResources) @ hadoop-yarn-common
---
[INFO] Using 'UTF-8' encoding to copy filtered resources.
[INFO] Copying 6 resources
[INFO] 
[INFO] --- maven-compiler-plugin:3.1:testCompile (default-testCompile) @ hadoop-yarn-common
---
[INFO] Compiling 74 source files to <https://builds.apache.org/job/Hadoop-Yarn-trunk/ws/hadoop-yarn-project/hadoop-yarn/hadoop-yarn-common/target/test-classes>
[INFO] 
[INFO] --- maven-jar-plugin:2.5:test-jar (default) @ hadoop-yarn-common ---
[INFO] Building jar: <https://builds.apache.org/job/Hadoop-Yarn-trunk/ws/hadoop-yarn-project/hadoop-yarn/hadoop-yarn-common/target/hadoop-yarn-common-3.0.0-SNAPSHOT-tests.jar>
[INFO] 
[INFO] --- maven-surefire-plugin:2.17:test (default-test) @ hadoop-yarn-common ---
[INFO] Surefire report directory: <https://builds.apache.org/job/Hadoop-Yarn-trunk/ws/hadoop-yarn-project/hadoop-yarn/hadoop-yarn-common/target/surefire-reports>

-------------------------------------------------------
 T E S T S
-------------------------------------------------------

-------------------------------------------------------
 T E S T S
-------------------------------------------------------
Running org.apache.hadoop.yarn.ipc.TestRPCUtil
Tests run: 11, Failures: 0, Errors: 0, Skipped: 0, Time elapsed: 0.167 sec - in org.apache.hadoop.yarn.ipc.TestRPCUtil
Running org.apache.hadoop.yarn.TestYarnUncaughtExceptionHandler
Exception: org.apache.hadoop.util.ExitUtil$ExitException thrown from the UncaughtExceptionHandler
in thread "Thread-0"
Exception: org.apache.hadoop.util.ExitUtil$HaltException thrown from the UncaughtExceptionHandler
in thread "Thread-3"
Tests run: 3, Failures: 0, Errors: 0, Skipped: 0, Time elapsed: 0.738 sec - in org.apache.hadoop.yarn.TestYarnUncaughtExceptionHandler
Running org.apache.hadoop.yarn.webapp.hamlet.TestHamletImpl
Tests run: 4, Failures: 0, Errors: 0, Skipped: 0, Time elapsed: 1.019 sec - in org.apache.hadoop.yarn.webapp.hamlet.TestHamletImpl
Running org.apache.hadoop.yarn.webapp.hamlet.TestHamlet
Tests run: 6, Failures: 0, Errors: 0, Skipped: 0, Time elapsed: 1.063 sec - in org.apache.hadoop.yarn.webapp.hamlet.TestHamlet
Running org.apache.hadoop.yarn.webapp.hamlet.TestParseSelector
Tests run: 5, Failures: 0, Errors: 0, Skipped: 0, Time elapsed: 0.338 sec - in org.apache.hadoop.yarn.webapp.hamlet.TestParseSelector
Running org.apache.hadoop.yarn.webapp.test.TestWebAppTests
Tests run: 4, Failures: 0, Errors: 0, Skipped: 0, Time elapsed: 1.005 sec - in org.apache.hadoop.yarn.webapp.test.TestWebAppTests
Running org.apache.hadoop.yarn.webapp.TestWebApp
Running org.apache.hadoop.yarn.webapp.TestParseRoute
Tests run: 10, Failures: 0, Errors: 0, Skipped: 0, Time elapsed: 0.662 sec - in org.apache.hadoop.yarn.webapp.TestParseRoute
Running org.apache.hadoop.yarn.webapp.util.TestWebAppUtils
Tests run: 3, Failures: 0, Errors: 0, Skipped: 0, Time elapsed: 2.831 sec - in org.apache.hadoop.yarn.webapp.util.TestWebAppUtils
Running org.apache.hadoop.yarn.webapp.TestSubViews
Tests run: 1, Failures: 0, Errors: 0, Skipped: 0, Time elapsed: 1.333 sec - in org.apache.hadoop.yarn.webapp.TestSubViews
Running org.apache.hadoop.yarn.webapp.view.TestCommonViews
Tests run: 5, Failures: 0, Errors: 0, Skipped: 0, Time elapsed: 1.708 sec - in org.apache.hadoop.yarn.webapp.view.TestCommonViews
Running org.apache.hadoop.yarn.webapp.view.TestInfoBlock
Tests run: 2, Failures: 0, Errors: 0, Skipped: 0, Time elapsed: 1.337 sec - in org.apache.hadoop.yarn.webapp.view.TestInfoBlock
Running org.apache.hadoop.yarn.webapp.view.TestHtmlBlock
Tests run: 3, Failures: 0, Errors: 0, Skipped: 0, Time elapsed: 1.532 sec - in org.apache.hadoop.yarn.webapp.view.TestHtmlBlock
Running org.apache.hadoop.yarn.webapp.view.TestTwoColumnCssPage
Tests run: 1, Failures: 0, Errors: 0, Skipped: 0, Time elapsed: 2.379 sec - in org.apache.hadoop.yarn.webapp.view.TestTwoColumnCssPage
Running org.apache.hadoop.yarn.webapp.view.TestTwoColumnLayout
Tests run: 1, Failures: 0, Errors: 0, Skipped: 0, Time elapsed: 1.991 sec - in org.apache.hadoop.yarn.webapp.view.TestTwoColumnLayout
Running org.apache.hadoop.yarn.webapp.view.TestHtmlPage
Tests run: 2, Failures: 0, Errors: 0, Skipped: 0, Time elapsed: 1.269 sec - in org.apache.hadoop.yarn.webapp.view.TestHtmlPage
Running org.apache.hadoop.yarn.logaggregation.TestAggregatedLogsBlock
Tests run: 6, Failures: 0, Errors: 0, Skipped: 0, Time elapsed: 2.962 sec - in org.apache.hadoop.yarn.logaggregation.TestAggregatedLogsBlock
Running org.apache.hadoop.yarn.logaggregation.TestAggregatedLogFormat
Tests run: 3, Failures: 0, Errors: 0, Skipped: 1, Time elapsed: 2.581 sec - in org.apache.hadoop.yarn.logaggregation.TestAggregatedLogFormat
Running org.apache.hadoop.yarn.logaggregation.TestAggregatedLogDeletionService
Tests run: 3, Failures: 0, Errors: 0, Skipped: 0, Time elapsed: 4.282 sec - in org.apache.hadoop.yarn.logaggregation.TestAggregatedLogDeletionService
Running org.apache.hadoop.yarn.TestContainerResourceIncreaseRPC
Tests run: 1, Failures: 0, Errors: 0, Skipped: 0, Time elapsed: 4.803 sec - in org.apache.hadoop.yarn.TestContainerResourceIncreaseRPC
Running org.apache.hadoop.yarn.TestRpcFactoryProvider
Tests run: 1, Failures: 0, Errors: 0, Skipped: 0, Time elapsed: 0.709 sec - in org.apache.hadoop.yarn.TestRpcFactoryProvider
Running org.apache.hadoop.yarn.event.TestAsyncDispatcher
Tests run: 2, Failures: 0, Errors: 0, Skipped: 0, Time elapsed: 3.432 sec - in org.apache.hadoop.yarn.event.TestAsyncDispatcher
Running org.apache.hadoop.yarn.TestRPCFactories
Tests run: 1, Failures: 0, Errors: 0, Skipped: 0, Time elapsed: 1.718 sec - in org.apache.hadoop.yarn.TestRPCFactories
Running org.apache.hadoop.yarn.security.TestYARNTokenIdentifier
Tests run: 8, Failures: 0, Errors: 0, Skipped: 0, Time elapsed: 1.589 sec - in org.apache.hadoop.yarn.security.TestYARNTokenIdentifier
Running org.apache.hadoop.yarn.util.TestConverterUtils
Tests run: 9, Failures: 0, Errors: 0, Skipped: 0, Time elapsed: 0.944 sec - in org.apache.hadoop.yarn.util.TestConverterUtils
Running org.apache.hadoop.yarn.util.TestFSDownload
Tests run: 10, Failures: 0, Errors: 0, Skipped: 1, Time elapsed: 4.121 sec - in org.apache.hadoop.yarn.util.TestFSDownload
Running org.apache.hadoop.yarn.util.TestAdHocLogDumper
Tests run: 1, Failures: 0, Errors: 0, Skipped: 0, Time elapsed: 2.43 sec - in org.apache.hadoop.yarn.util.TestAdHocLogDumper
Running org.apache.hadoop.yarn.util.TestResourceCalculatorProcessTree
Tests run: 2, Failures: 0, Errors: 0, Skipped: 0, Time elapsed: 0.423 sec - in org.apache.hadoop.yarn.util.TestResourceCalculatorProcessTree
Running org.apache.hadoop.yarn.util.TestProcfsBasedProcessTree
Tests run: 5, Failures: 0, Errors: 0, Skipped: 0, Time elapsed: 2.494 sec - in org.apache.hadoop.yarn.util.TestProcfsBasedProcessTree
Running org.apache.hadoop.yarn.util.TestWindowsBasedProcessTree
Tests run: 1, Failures: 0, Errors: 0, Skipped: 0, Time elapsed: 0.398 sec - in org.apache.hadoop.yarn.util.TestWindowsBasedProcessTree
Running org.apache.hadoop.yarn.util.TestRackResolverScriptBasedMapping
Tests run: 1, Failures: 0, Errors: 0, Skipped: 0, Time elapsed: 0.907 sec - in org.apache.hadoop.yarn.util.TestRackResolverScriptBasedMapping
Running org.apache.hadoop.yarn.util.resource.TestResourceCalculator
Tests run: 4, Failures: 0, Errors: 0, Skipped: 0, Time elapsed: 0.645 sec - in org.apache.hadoop.yarn.util.resource.TestResourceCalculator
Running org.apache.hadoop.yarn.util.resource.TestResources
Tests run: 2, Failures: 0, Errors: 0, Skipped: 0, Time elapsed: 0.856 sec - in org.apache.hadoop.yarn.util.resource.TestResources
Running org.apache.hadoop.yarn.util.TestYarnVersionInfo
Tests run: 1, Failures: 0, Errors: 0, Skipped: 0, Time elapsed: 0.417 sec - in org.apache.hadoop.yarn.util.TestYarnVersionInfo
Running org.apache.hadoop.yarn.util.TestApps
Tests run: 1, Failures: 0, Errors: 0, Skipped: 0, Time elapsed: 0.524 sec - in org.apache.hadoop.yarn.util.TestApps
Running org.apache.hadoop.yarn.util.TestRackResolver
Tests run: 1, Failures: 0, Errors: 0, Skipped: 0, Time elapsed: 1.099 sec - in org.apache.hadoop.yarn.util.TestRackResolver
Running org.apache.hadoop.yarn.util.TestLog4jWarningErrorMetricsAppender
Tests run: 6, Failures: 0, Errors: 0, Skipped: 0, Time elapsed: 9.537 sec - in org.apache.hadoop.yarn.util.TestLog4jWarningErrorMetricsAppender
Running org.apache.hadoop.yarn.util.TestTimes
Tests run: 5, Failures: 0, Errors: 0, Skipped: 0, Time elapsed: 0.372 sec - in org.apache.hadoop.yarn.util.TestTimes
Running org.apache.hadoop.yarn.TestRPC
Tests run: 2, Failures: 0, Errors: 0, Skipped: 0, Time elapsed: 3.335 sec - in org.apache.hadoop.yarn.TestRPC
Running org.apache.hadoop.yarn.server.security.TestApplicationACLsManager
Tests run: 3, Failures: 0, Errors: 0, Skipped: 0, Time elapsed: 1.865 sec - in org.apache.hadoop.yarn.server.security.TestApplicationACLsManager
Running org.apache.hadoop.yarn.TestContainerLogAppender
Tests run: 1, Failures: 0, Errors: 0, Skipped: 0, Time elapsed: 0.395 sec - in org.apache.hadoop.yarn.TestContainerLogAppender
Running org.apache.hadoop.yarn.client.api.impl.TestTimelineClientForATS1_5
Tests run: 2, Failures: 0, Errors: 0, Skipped: 0, Time elapsed: 6.065 sec - in org.apache.hadoop.yarn.client.api.impl.TestTimelineClientForATS1_5
Running org.apache.hadoop.yarn.client.api.impl.TestTimelineClient
Tests run: 10, Failures: 0, Errors: 0, Skipped: 0, Time elapsed: 20.414 sec - in org.apache.hadoop.yarn.client.api.impl.TestTimelineClient
Running org.apache.hadoop.yarn.client.TestClientRMProxy
Tests run: 2, Failures: 0, Errors: 0, Skipped: 0, Time elapsed: 1.247 sec - in org.apache.hadoop.yarn.client.TestClientRMProxy
Running org.apache.hadoop.yarn.api.records.timeline.TestTimelineRecords
Tests run: 5, Failures: 0, Errors: 0, Skipped: 0, Time elapsed: 0.878 sec - in org.apache.hadoop.yarn.api.records.timeline.TestTimelineRecords
Running org.apache.hadoop.yarn.api.records.impl.pb.TestSerializedExceptionPBImpl
Tests run: 5, Failures: 0, Errors: 0, Skipped: 0, Time elapsed: 0.15 sec - in org.apache.hadoop.yarn.api.records.impl.pb.TestSerializedExceptionPBImpl
Running org.apache.hadoop.yarn.api.TestGetApplicationsRequest
Tests run: 1, Failures: 0, Errors: 0, Skipped: 0, Time elapsed: 0.629 sec - in org.apache.hadoop.yarn.api.TestGetApplicationsRequest
Running org.apache.hadoop.yarn.api.TestApplicationAttemptId
Tests run: 1, Failures: 0, Errors: 0, Skipped: 0, Time elapsed: 0.221 sec - in org.apache.hadoop.yarn.api.TestApplicationAttemptId
Running org.apache.hadoop.yarn.api.TestContainerId
Tests run: 1, Failures: 0, Errors: 0, Skipped: 0, Time elapsed: 0.624 sec - in org.apache.hadoop.yarn.api.TestContainerId
Running org.apache.hadoop.yarn.api.TestTimelineEntityGroupId
Tests run: 1, Failures: 0, Errors: 0, Skipped: 0, Time elapsed: 0.703 sec - in org.apache.hadoop.yarn.api.TestTimelineEntityGroupId
Running org.apache.hadoop.yarn.api.TestNodeId
Tests run: 1, Failures: 0, Errors: 0, Skipped: 0, Time elapsed: 0.634 sec - in org.apache.hadoop.yarn.api.TestNodeId
Running org.apache.hadoop.yarn.api.TestPBImplRecords
Tests run: 121, Failures: 0, Errors: 0, Skipped: 5, Time elapsed: 3.09 sec - in org.apache.hadoop.yarn.api.TestPBImplRecords
Running org.apache.hadoop.yarn.api.TestApplicatonReport
Tests run: 1, Failures: 0, Errors: 0, Skipped: 0, Time elapsed: 0.941 sec - in org.apache.hadoop.yarn.api.TestApplicatonReport
Running org.apache.hadoop.yarn.api.TestApplicationId
Tests run: 1, Failures: 0, Errors: 0, Skipped: 0, Time elapsed: 0.874 sec - in org.apache.hadoop.yarn.api.TestApplicationId
Running org.apache.hadoop.yarn.conf.TestHAUtil
Tests run: 4, Failures: 0, Errors: 0, Skipped: 0, Time elapsed: 2.331 sec - in org.apache.hadoop.yarn.conf.TestHAUtil
Running org.apache.hadoop.yarn.conf.TestYarnConfiguration
Tests run: 5, Failures: 0, Errors: 0, Skipped: 0, Time elapsed: 1.982 sec - in org.apache.hadoop.yarn.conf.TestYarnConfiguration
Running org.apache.hadoop.yarn.nodelabels.TestCommonNodeLabelsManager
Tests run: 16, Failures: 0, Errors: 0, Skipped: 0, Time elapsed: 2.955 sec - in org.apache.hadoop.yarn.nodelabels.TestCommonNodeLabelsManager
Running org.apache.hadoop.yarn.nodelabels.TestFileSystemNodeLabelsStore
Tests run: 10, Failures: 0, Errors: 0, Skipped: 0, Time elapsed: 3.511 sec - in org.apache.hadoop.yarn.nodelabels.TestFileSystemNodeLabelsStore
Running org.apache.hadoop.yarn.TestContainerLaunchRPC
Tests run: 1, Failures: 0, Errors: 0, Skipped: 0, Time elapsed: 5.544 sec - in org.apache.hadoop.yarn.TestContainerLaunchRPC
Running org.apache.hadoop.yarn.TestRecordFactory
Tests run: 1, Failures: 0, Errors: 0, Skipped: 0, Time elapsed: 0.508 sec - in org.apache.hadoop.yarn.TestRecordFactory

Results :

Tests run: 330, Failures: 0, Errors: 0, Skipped: 7

[INFO] ------------------------------------------------------------------------
[INFO] Reactor Summary:
[INFO] 
[INFO] Apache Hadoop YARN ................................ SUCCESS [  5.885 s]
[INFO] Apache Hadoop YARN API ............................ SUCCESS [06:43 min]
[INFO] Apache Hadoop YARN Common ......................... FAILURE [17:44 min]
[INFO] Apache Hadoop YARN Server ......................... SKIPPED
[INFO] Apache Hadoop YARN Server Common .................. SKIPPED
[INFO] Apache Hadoop YARN NodeManager .................... SKIPPED
[INFO] Apache Hadoop YARN Web Proxy ...................... SKIPPED
[INFO] Apache Hadoop YARN ApplicationHistoryService ...... SKIPPED
[INFO] Apache Hadoop YARN ResourceManager ................ SKIPPED
[INFO] Apache Hadoop YARN Server Tests ................... SKIPPED
[INFO] Apache Hadoop YARN Client ......................... SKIPPED
[INFO] Apache Hadoop YARN SharedCacheManager ............. SKIPPED
[INFO] Apache Hadoop YARN Timeline Plugin Storage ........ SKIPPED
[INFO] Apache Hadoop YARN Applications ................... SKIPPED
[INFO] Apache Hadoop YARN DistributedShell ............... SKIPPED
[INFO] Apache Hadoop YARN Unmanaged Am Launcher .......... SKIPPED
[INFO] Apache Hadoop YARN Site ........................... SKIPPED
[INFO] Apache Hadoop YARN Registry ....................... SKIPPED
[INFO] Apache Hadoop YARN Project ........................ SKIPPED
[INFO] ------------------------------------------------------------------------
[INFO] BUILD FAILURE
[INFO] ------------------------------------------------------------------------
[INFO] Total time: 24:36 min
[INFO] Finished at: 2016-03-16T03:37:59+00:00
[INFO] Final Memory: 69M/918M
[INFO] ------------------------------------------------------------------------
[ERROR] Failed to execute goal org.apache.maven.plugins:maven-surefire-plugin:2.17:test (default-test)
on project hadoop-yarn-common: There was a timeout or other error in the fork -> [Help
1]
[ERROR] 
[ERROR] To see the full stack trace of the errors, re-run Maven with the -e switch.
[ERROR] Re-run Maven using the -X switch to enable full debug logging.
[ERROR] 
[ERROR] For more information about the errors and possible solutions, please read the following
articles:
[ERROR] [Help 1] http://cwiki.apache.org/confluence/display/MAVEN/MojoFailureException
[ERROR] 
[ERROR] After correcting the problems, you can resume the build with the command
[ERROR]   mvn <goals> -rf :hadoop-yarn-common
Build step 'Execute shell' marked build as failure
Archiving artifacts
Recording test results

Mime
View raw message