hadoop-yarn-dev mailing list archives

Site index · List index
Message view « Date » · « Thread »
Top « Date » · « Thread »
From Apache Jenkins Server <jenk...@builds.apache.org>
Subject Hadoop-Yarn-trunk-Java8 - Build # 1133 - Still Failing
Date Tue, 01 Mar 2016 06:32:48 GMT
See https://builds.apache.org/job/Hadoop-Yarn-trunk-Java8/1133/

###################################################################################
########################## LAST 60 LINES OF THE CONSOLE ###########################
[...truncated 5257 lines...]
Java HotSpot(TM) 64-Bit Server VM warning: ignoring option MaxPermSize=768m; support was removed
in 8.0
Running org.apache.hadoop.yarn.server.resourcemanager.webapp.TestRMWebServicesCapacitySched
Tests run: 7, Failures: 0, Errors: 0, Skipped: 0, Time elapsed: 13.15 sec - in org.apache.hadoop.yarn.server.resourcemanager.webapp.TestRMWebServicesCapacitySched

Results :

Tests in error: 
  TestApplicationMasterService.testRMIdentifierOnContainerAllocation:114 ยป NoClassDefFound

Tests run: 1419, Failures: 0, Errors: 1, Skipped: 2

[INFO] ------------------------------------------------------------------------
[INFO] Reactor Summary:
[INFO] 
[INFO] Apache Hadoop YARN ................................ SUCCESS [  3.060 s]
[INFO] Apache Hadoop YARN API ............................ SUCCESS [01:22 min]
[INFO] Apache Hadoop YARN Common ......................... SUCCESS [02:37 min]
[INFO] Apache Hadoop YARN Server ......................... SUCCESS [  0.091 s]
[INFO] Apache Hadoop YARN Server Common .................. SUCCESS [ 36.965 s]
[INFO] Apache Hadoop YARN NodeManager .................... SUCCESS [10:01 min]
[INFO] Apache Hadoop YARN Web Proxy ...................... SUCCESS [ 16.141 s]
[INFO] Apache Hadoop YARN ApplicationHistoryService ...... SUCCESS [03:56 min]
[INFO] Apache Hadoop YARN ResourceManager ................ FAILURE [  01:12 h]
[INFO] Apache Hadoop YARN Server Tests ................... SKIPPED
[INFO] Apache Hadoop YARN Client ......................... SKIPPED
[INFO] Apache Hadoop YARN SharedCacheManager ............. SKIPPED
[INFO] Apache Hadoop YARN Timeline Plugin Storage ........ SKIPPED
[INFO] Apache Hadoop YARN Applications ................... SKIPPED
[INFO] Apache Hadoop YARN DistributedShell ............... SKIPPED
[INFO] Apache Hadoop YARN Unmanaged Am Launcher .......... SKIPPED
[INFO] Apache Hadoop YARN Site ........................... SKIPPED
[INFO] Apache Hadoop YARN Registry ....................... SKIPPED
[INFO] Apache Hadoop YARN Project ........................ SKIPPED
[INFO] ------------------------------------------------------------------------
[INFO] BUILD FAILURE
[INFO] ------------------------------------------------------------------------
[INFO] Total time: 01:31 h
[INFO] Finished at: 2016-03-01T06:32:44+00:00
[INFO] Final Memory: 62M/1051M
[INFO] ------------------------------------------------------------------------
[ERROR] Failed to execute goal org.apache.maven.plugins:maven-surefire-plugin:2.17:test (default-test)
on project hadoop-yarn-server-resourcemanager: There are test failures.
[ERROR] 
[ERROR] Please refer to /home/jenkins/jenkins-slave/workspace/Hadoop-Yarn-trunk-Java8/hadoop-yarn-project/hadoop-yarn/hadoop-yarn-server/hadoop-yarn-server-resourcemanager/target/surefire-reports
for the individual test results.
[ERROR] -> [Help 1]
[ERROR] 
[ERROR] To see the full stack trace of the errors, re-run Maven with the -e switch.
[ERROR] Re-run Maven using the -X switch to enable full debug logging.
[ERROR] 
[ERROR] For more information about the errors and possible solutions, please read the following
articles:
[ERROR] [Help 1] http://cwiki.apache.org/confluence/display/MAVEN/MojoFailureException
[ERROR] 
[ERROR] After correcting the problems, you can resume the build with the command
[ERROR]   mvn <goals> -rf :hadoop-yarn-server-resourcemanager
Build step 'Execute shell' marked build as failure
Archiving artifacts
Recording test results
Sending e-mails to: yarn-dev@hadoop.apache.org
Email was triggered for: Failure - Any
Sending email for trigger: Failure - Any



###################################################################################
############################## FAILED TESTS (if any) ##############################
1 tests failed.
FAILED:  org.apache.hadoop.yarn.server.resourcemanager.TestApplicationMasterService.testRMIdentifierOnContainerAllocation

Error Message:
org/apache/hadoop/io/FastByteComparisons

Stack Trace:
java.lang.NoClassDefFoundError: org/apache/hadoop/io/FastByteComparisons
	at java.net.URLClassLoader$1.run(URLClassLoader.java:372)
	at java.net.URLClassLoader$1.run(URLClassLoader.java:361)
	at java.security.AccessController.doPrivileged(Native Method)
	at java.net.URLClassLoader.findClass(URLClassLoader.java:360)
	at java.lang.ClassLoader.loadClass(ClassLoader.java:424)
	at sun.misc.Launcher$AppClassLoader.loadClass(Launcher.java:308)
	at java.lang.ClassLoader.loadClass(ClassLoader.java:357)
	at org.apache.hadoop.io.WritableComparator.compareBytes(WritableComparator.java:188)
	at org.apache.hadoop.io.BinaryComparable.compareTo(BinaryComparable.java:50)
	at org.apache.hadoop.io.BinaryComparable.equals(BinaryComparable.java:72)
	at org.apache.hadoop.io.Text.equals(Text.java:348)
	at java.util.HashMap.getNode(HashMap.java:571)
	at java.util.HashMap.get(HashMap.java:556)
	at org.apache.hadoop.security.token.Token.getClassForIdentifier(Token.java:121)
	at org.apache.hadoop.security.token.Token.decodeIdentifier(Token.java:138)
	at org.apache.hadoop.yarn.server.utils.BuilderUtils.newContainerTokenIdentifier(BuilderUtils.java:288)
	at org.apache.hadoop.yarn.server.resourcemanager.TestApplicationMasterService.testRMIdentifierOnContainerAllocation(TestApplicationMasterService.java:114)



Mime
  • Unnamed multipart/mixed (inline, None, 0 bytes)
View raw message