hadoop-yarn-dev mailing list archives

Site index · List index
Message view « Date » · « Thread »
Top « Date » · « Thread »
From Apache Jenkins Server <jenk...@builds.apache.org>
Subject Build failed in Jenkins: Hadoop-Yarn-trunk #1953
Date Thu, 31 Mar 2016 20:58:34 GMT
See <https://builds.apache.org/job/Hadoop-Yarn-trunk/1953/changes>

Changes:

[rkanter] YARN-4639. Remove dead code in TestDelegationTokenRenewer added in

------------------------------------------
[...truncated 3632 lines...]
[INFO] Apache Hadoop HttpFS .............................. SUCCESS [ 12.566 s]
[INFO] Apache Hadoop HDFS BookKeeper Journal ............. SUCCESS [  0.482 s]
[INFO] Apache Hadoop HDFS-NFS ............................ SUCCESS [  0.466 s]
[INFO] Apache Hadoop HDFS Project ........................ SUCCESS [  0.026 s]
[INFO] Apache Hadoop YARN ................................ SUCCESS [  0.027 s]
[INFO] Apache Hadoop YARN API ............................ SUCCESS [  3.819 s]
[INFO] Apache Hadoop YARN Common ......................... SUCCESS [  3.475 s]
[INFO] Apache Hadoop YARN Server ......................... SUCCESS [  0.041 s]
[INFO] Apache Hadoop YARN Server Common .................. SUCCESS [  0.953 s]
[INFO] Apache Hadoop YARN NodeManager .................... SUCCESS [  1.763 s]
[INFO] Apache Hadoop YARN Web Proxy ...................... SUCCESS [  0.342 s]
[INFO] Apache Hadoop YARN ApplicationHistoryService ...... SUCCESS [  0.867 s]
[INFO] Apache Hadoop YARN ResourceManager ................ SUCCESS [  3.805 s]
[INFO] Apache Hadoop YARN Server Tests ................... SUCCESS [  0.597 s]
[INFO] Apache Hadoop YARN Client ......................... SUCCESS [  0.797 s]
[INFO] Apache Hadoop YARN SharedCacheManager ............. SUCCESS [  0.337 s]
[INFO] Apache Hadoop YARN Timeline Plugin Storage ........ SUCCESS [  0.514 s]
[INFO] Apache Hadoop YARN Applications ................... SUCCESS [  0.027 s]
[INFO] Apache Hadoop YARN DistributedShell ............... SUCCESS [  0.349 s]
[INFO] Apache Hadoop YARN Unmanaged Am Launcher .......... SUCCESS [  0.240 s]
[INFO] Apache Hadoop YARN Site ........................... SUCCESS [  0.028 s]
[INFO] Apache Hadoop YARN Registry ....................... SUCCESS [  0.450 s]
[INFO] Apache Hadoop YARN Project ........................ SUCCESS [  0.066 s]
[INFO] Apache Hadoop MapReduce Client .................... SUCCESS [  0.066 s]
[INFO] Apache Hadoop MapReduce Core ...................... SUCCESS [  2.614 s]
[INFO] Apache Hadoop MapReduce Common .................... SUCCESS [  1.463 s]
[INFO] Apache Hadoop MapReduce Shuffle ................... SUCCESS [  0.371 s]
[INFO] Apache Hadoop MapReduce App ....................... SUCCESS [  1.398 s]
[INFO] Apache Hadoop MapReduce HistoryServer ............. SUCCESS [  0.698 s]
[INFO] Apache Hadoop MapReduce JobClient ................. SUCCESS [  1.755 s]
[INFO] Apache Hadoop MapReduce HistoryServer Plugins ..... SUCCESS [  0.182 s]
[INFO] Apache Hadoop MapReduce NativeTask ................ SUCCESS [  0.364 s]
[INFO] Apache Hadoop MapReduce Examples .................. SUCCESS [  0.641 s]
[INFO] Apache Hadoop MapReduce ........................... SUCCESS [  0.077 s]
[INFO] Apache Hadoop MapReduce Streaming ................. SUCCESS [  0.788 s]
[INFO] Apache Hadoop Distributed Copy .................... SUCCESS [  0.708 s]
[INFO] Apache Hadoop Archives ............................ SUCCESS [  0.259 s]
[INFO] Apache Hadoop Archive Logs ........................ SUCCESS [  0.348 s]
[INFO] Apache Hadoop Rumen ............................... SUCCESS [  0.530 s]
[INFO] Apache Hadoop Gridmix ............................. SUCCESS [  0.512 s]
[INFO] Apache Hadoop Data Join ........................... SUCCESS [  0.241 s]
[INFO] Apache Hadoop Ant Tasks ........................... SUCCESS [  0.106 s]
[INFO] Apache Hadoop Extras .............................. SUCCESS [  0.261 s]
[INFO] Apache Hadoop Pipes ............................... SUCCESS [  0.022 s]
[INFO] Apache Hadoop OpenStack support ................... SUCCESS [  0.288 s]
[INFO] Apache Hadoop Amazon Web Services support ......... SUCCESS [  0.283 s]
[INFO] Apache Hadoop Azure support ....................... SUCCESS [  0.491 s]
[INFO] Apache Hadoop Client .............................. SUCCESS [  0.546 s]
[INFO] Apache Hadoop Mini-Cluster ........................ SUCCESS [  0.107 s]
[INFO] Apache Hadoop Scheduler Load Simulator ............ SUCCESS [  0.842 s]
[INFO] Apache Hadoop Tools Dist .......................... SUCCESS [  0.258 s]
[INFO] Apache Hadoop Kafka Library support ............... SUCCESS [  0.124 s]
[INFO] Apache Hadoop Tools ............................... SUCCESS [  0.021 s]
[INFO] Apache Hadoop Distribution ........................ SUCCESS [  0.063 s]
[INFO] ------------------------------------------------------------------------
[INFO] BUILD SUCCESS
[INFO] ------------------------------------------------------------------------
[INFO] Total time: 01:46 min
[INFO] Finished at: 2016-03-31T20:58:17+00:00
[INFO] Final Memory: 246M/1248M
[INFO] ------------------------------------------------------------------------
+ cd hadoop-yarn-project
+ /home/jenkins/tools/maven/latest/bin/mvn clean verify checkstyle:checkstyle findbugs:findbugs
-Pdist -Pnative -Dtar
[INFO] Scanning for projects...
[INFO] ------------------------------------------------------------------------
[INFO] Reactor Build Order:
[INFO] 
[INFO] Apache Hadoop YARN
[INFO] Apache Hadoop YARN API
[INFO] Apache Hadoop YARN Common
[INFO] Apache Hadoop YARN Server
[INFO] Apache Hadoop YARN Server Common
[INFO] Apache Hadoop YARN NodeManager
[INFO] Apache Hadoop YARN Web Proxy
[INFO] Apache Hadoop YARN ApplicationHistoryService
[INFO] Apache Hadoop YARN ResourceManager
[INFO] Apache Hadoop YARN Server Tests
[INFO] Apache Hadoop YARN Client
[INFO] Apache Hadoop YARN SharedCacheManager
[INFO] Apache Hadoop YARN Timeline Plugin Storage
[INFO] Apache Hadoop YARN Applications
[INFO] Apache Hadoop YARN DistributedShell
[INFO] Apache Hadoop YARN Unmanaged Am Launcher
[INFO] Apache Hadoop YARN Site
[INFO] Apache Hadoop YARN Registry
[INFO] Apache Hadoop YARN Project
[INFO] 
[INFO] Using the builder org.apache.maven.lifecycle.internal.builder.singlethreaded.SingleThreadedBuilder
with a thread count of 1
[INFO]                                                                         
[INFO] ------------------------------------------------------------------------
[INFO] Building Apache Hadoop YARN 3.0.0-SNAPSHOT
[INFO] ------------------------------------------------------------------------
[INFO] 
[INFO] --- maven-clean-plugin:2.5:clean (default-clean) @ hadoop-yarn ---
[INFO] Deleting <https://builds.apache.org/job/Hadoop-Yarn-trunk/ws/hadoop-yarn-project/hadoop-yarn/target>
[INFO] 
[INFO] --- maven-antrun-plugin:1.7:run (create-testdirs) @ hadoop-yarn ---
[INFO] Executing tasks

main:
    [mkdir] Created dir: <https://builds.apache.org/job/Hadoop-Yarn-trunk/ws/hadoop-yarn-project/hadoop-yarn/target/test-dir>
[INFO] Executed tasks
[INFO] 
[INFO] --- maven-source-plugin:2.3:jar-no-fork (hadoop-java-sources) @ hadoop-yarn ---
[INFO] 
[INFO] --- maven-source-plugin:2.3:test-jar-no-fork (hadoop-java-sources) @ hadoop-yarn ---
[INFO] 
[INFO] --- maven-enforcer-plugin:1.3.1:enforce (dist-enforce) @ hadoop-yarn ---
[INFO] 
[INFO] --- maven-site-plugin:3.5:attach-descriptor (attach-descriptor) @ hadoop-yarn ---
[INFO] 
[INFO] --- maven-javadoc-plugin:2.8.1:jar (module-javadocs) @ hadoop-yarn ---
[INFO] Not executing Javadoc as the project is not a Java classpath-capable package
[INFO] 
[INFO] --- maven-enforcer-plugin:1.3.1:enforce (depcheck) @ hadoop-yarn ---
[INFO] 
[INFO] --- maven-checkstyle-plugin:2.15:checkstyle (default-cli) @ hadoop-yarn ---
[INFO] 
[INFO] --- findbugs-maven-plugin:3.0.0:findbugs (default-cli) @ hadoop-yarn ---
[INFO]                                                                         
[INFO] ------------------------------------------------------------------------
[INFO] Building Apache Hadoop YARN API 3.0.0-SNAPSHOT
[INFO] ------------------------------------------------------------------------
[INFO] 
[INFO] --- maven-clean-plugin:2.5:clean (default-clean) @ hadoop-yarn-api ---
[INFO] Deleting <https://builds.apache.org/job/Hadoop-Yarn-trunk/ws/hadoop-yarn-project/hadoop-yarn/hadoop-yarn-api/target>
[INFO] 
[INFO] --- maven-antrun-plugin:1.7:run (create-testdirs) @ hadoop-yarn-api ---
[INFO] Executing tasks

main:
    [mkdir] Created dir: <https://builds.apache.org/job/Hadoop-Yarn-trunk/ws/hadoop-yarn-project/hadoop-yarn/hadoop-yarn-api/target/test-dir>
[INFO] Executed tasks
[INFO] 
[INFO] --- hadoop-maven-plugins:3.0.0-SNAPSHOT:protoc (compile-protoc) @ hadoop-yarn-api ---
[INFO] Wrote protoc checksums to file <https://builds.apache.org/job/Hadoop-Yarn-trunk/ws/hadoop-yarn-project/hadoop-yarn/hadoop-yarn-api/target/hadoop-maven-plugins-protoc-checksums.json>
[INFO] 
[INFO] --- maven-resources-plugin:2.6:resources (default-resources) @ hadoop-yarn-api ---
[INFO] Using 'UTF-8' encoding to copy filtered resources.
[INFO] Copying 1 resource
[INFO] 
[INFO] --- maven-compiler-plugin:3.1:compile (default-compile) @ hadoop-yarn-api ---
[INFO] Compiling 236 source files to <https://builds.apache.org/job/Hadoop-Yarn-trunk/ws/hadoop-yarn-project/hadoop-yarn/hadoop-yarn-api/target/classes>
[INFO] 
[INFO] --- maven-resources-plugin:2.6:testResources (default-testResources) @ hadoop-yarn-api
---
[INFO] Using 'UTF-8' encoding to copy filtered resources.
[INFO] skip non existing resourceDirectory <https://builds.apache.org/job/Hadoop-Yarn-trunk/ws/hadoop-yarn-project/hadoop-yarn/hadoop-yarn-api/src/test/resources>
[INFO] 
[INFO] --- maven-compiler-plugin:3.1:testCompile (default-testCompile) @ hadoop-yarn-api ---
[INFO] Compiling 1 source file to <https://builds.apache.org/job/Hadoop-Yarn-trunk/ws/hadoop-yarn-project/hadoop-yarn/hadoop-yarn-api/target/test-classes>
[INFO] 
[INFO] --- maven-jar-plugin:2.5:test-jar (default) @ hadoop-yarn-api ---
[INFO] Building jar: <https://builds.apache.org/job/Hadoop-Yarn-trunk/ws/hadoop-yarn-project/hadoop-yarn/hadoop-yarn-api/target/hadoop-yarn-api-3.0.0-SNAPSHOT-tests.jar>
[INFO] 
[INFO] --- maven-surefire-plugin:2.17:test (default-test) @ hadoop-yarn-api ---
[INFO] Surefire report directory: <https://builds.apache.org/job/Hadoop-Yarn-trunk/ws/hadoop-yarn-project/hadoop-yarn/hadoop-yarn-api/target/surefire-reports>

-------------------------------------------------------
 T E S T S
-------------------------------------------------------

-------------------------------------------------------
 T E S T S
-------------------------------------------------------
Running org.apache.hadoop.yarn.conf.TestYarnConfigurationFields
Tests run: 2, Failures: 1, Errors: 0, Skipped: 0, Time elapsed: 0.508 sec <<< FAILURE!
- in org.apache.hadoop.yarn.conf.TestYarnConfigurationFields
testCompareXmlAgainstConfigurationClass(org.apache.hadoop.yarn.conf.TestYarnConfigurationFields)
 Time elapsed: 0.335 sec  <<< FAILURE!
java.lang.AssertionError: yarn-default.xml has 6 properties missing in  class org.apache.hadoop.yarn.conf.YarnConfiguration
	at org.junit.Assert.fail(Assert.java:88)
	at org.junit.Assert.assertTrue(Assert.java:41)
	at org.apache.hadoop.conf.TestConfigurationFieldsBase.testCompareXmlAgainstConfigurationClass(TestConfigurationFieldsBase.java:464)
	at sun.reflect.NativeMethodAccessorImpl.invoke0(Native Method)
	at sun.reflect.NativeMethodAccessorImpl.invoke(NativeMethodAccessorImpl.java:57)
	at sun.reflect.DelegatingMethodAccessorImpl.invoke(DelegatingMethodAccessorImpl.java:43)
	at java.lang.reflect.Method.invoke(Method.java:606)
	at org.junit.runners.model.FrameworkMethod$1.runReflectiveCall(FrameworkMethod.java:47)
	at org.junit.internal.runners.model.ReflectiveCallable.run(ReflectiveCallable.java:12)
	at org.junit.runners.model.FrameworkMethod.invokeExplosively(FrameworkMethod.java:44)
	at org.junit.internal.runners.statements.InvokeMethod.evaluate(InvokeMethod.java:17)
	at org.junit.internal.runners.statements.RunBefores.evaluate(RunBefores.java:26)
	at org.junit.runners.ParentRunner.runLeaf(ParentRunner.java:271)
	at org.junit.runners.BlockJUnit4ClassRunner.runChild(BlockJUnit4ClassRunner.java:70)
	at org.junit.runners.BlockJUnit4ClassRunner.runChild(BlockJUnit4ClassRunner.java:50)
	at org.junit.runners.ParentRunner$3.run(ParentRunner.java:238)
	at org.junit.runners.ParentRunner$1.schedule(ParentRunner.java:63)
	at org.junit.runners.ParentRunner.runChildren(ParentRunner.java:236)
	at org.junit.runners.ParentRunner.access$000(ParentRunner.java:53)
	at org.junit.runners.ParentRunner$2.evaluate(ParentRunner.java:229)
	at org.junit.runners.ParentRunner.run(ParentRunner.java:309)
	at org.apache.maven.surefire.junit4.JUnit4Provider.execute(JUnit4Provider.java:264)
	at org.apache.maven.surefire.junit4.JUnit4Provider.executeTestSet(JUnit4Provider.java:153)
	at org.apache.maven.surefire.junit4.JUnit4Provider.invoke(JUnit4Provider.java:124)
	at org.apache.maven.surefire.booter.ForkedBooter.invokeProviderInSameClassLoader(ForkedBooter.java:200)
	at org.apache.maven.surefire.booter.ForkedBooter.runSuitesInProcess(ForkedBooter.java:153)
	at org.apache.maven.surefire.booter.ForkedBooter.main(ForkedBooter.java:103)


Results :

Failed tests: 
  TestYarnConfigurationFields>TestConfigurationFieldsBase.testCompareXmlAgainstConfigurationClass:464
yarn-default.xml has 6 properties missing in  class org.apache.hadoop.yarn.conf.YarnConfiguration

Tests run: 2, Failures: 1, Errors: 0, Skipped: 0

[INFO] ------------------------------------------------------------------------
[INFO] Reactor Summary:
[INFO] 
[INFO] Apache Hadoop YARN ................................ SUCCESS [  3.296 s]
[INFO] Apache Hadoop YARN API ............................ FAILURE [ 12.434 s]
[INFO] Apache Hadoop YARN Common ......................... SKIPPED
[INFO] Apache Hadoop YARN Server ......................... SKIPPED
[INFO] Apache Hadoop YARN Server Common .................. SKIPPED
[INFO] Apache Hadoop YARN NodeManager .................... SKIPPED
[INFO] Apache Hadoop YARN Web Proxy ...................... SKIPPED
[INFO] Apache Hadoop YARN ApplicationHistoryService ...... SKIPPED
[INFO] Apache Hadoop YARN ResourceManager ................ SKIPPED
[INFO] Apache Hadoop YARN Server Tests ................... SKIPPED
[INFO] Apache Hadoop YARN Client ......................... SKIPPED
[INFO] Apache Hadoop YARN SharedCacheManager ............. SKIPPED
[INFO] Apache Hadoop YARN Timeline Plugin Storage ........ SKIPPED
[INFO] Apache Hadoop YARN Applications ................... SKIPPED
[INFO] Apache Hadoop YARN DistributedShell ............... SKIPPED
[INFO] Apache Hadoop YARN Unmanaged Am Launcher .......... SKIPPED
[INFO] Apache Hadoop YARN Site ........................... SKIPPED
[INFO] Apache Hadoop YARN Registry ....................... SKIPPED
[INFO] Apache Hadoop YARN Project ........................ SKIPPED
[INFO] ------------------------------------------------------------------------
[INFO] BUILD FAILURE
[INFO] ------------------------------------------------------------------------
[INFO] Total time: 17.456 s
[INFO] Finished at: 2016-03-31T20:58:36+00:00
[INFO] Final Memory: 59M/1090M
[INFO] ------------------------------------------------------------------------
[ERROR] Failed to execute goal org.apache.maven.plugins:maven-surefire-plugin:2.17:test (default-test)
on project hadoop-yarn-api: There are test failures.
[ERROR] 
[ERROR] Please refer to <https://builds.apache.org/job/Hadoop-Yarn-trunk/ws/hadoop-yarn-project/hadoop-yarn/hadoop-yarn-api/target/surefire-reports>
for the individual test results.
[ERROR] -> [Help 1]
[ERROR] 
[ERROR] To see the full stack trace of the errors, re-run Maven with the -e switch.
[ERROR] Re-run Maven using the -X switch to enable full debug logging.
[ERROR] 
[ERROR] For more information about the errors and possible solutions, please read the following
articles:
[ERROR] [Help 1] http://cwiki.apache.org/confluence/display/MAVEN/MojoFailureException
[ERROR] 
[ERROR] After correcting the problems, you can resume the build with the command
[ERROR]   mvn <goals> -rf :hadoop-yarn-api
Build step 'Execute shell' marked build as failure
Archiving artifacts
Recording test results

Mime
View raw message