hadoop-yarn-dev mailing list archives

Site index · List index
Message view « Date » · « Thread »
Top « Date » · « Thread »
From Apache Jenkins Server <jenk...@builds.apache.org>
Subject Hadoop-Yarn-trunk - Build # 1817 - Still Failing
Date Thu, 25 Feb 2016 03:55:59 GMT
See https://builds.apache.org/job/Hadoop-Yarn-trunk/1817/

###################################################################################
########################## LAST 60 LINES OF THE CONSOLE ###########################
[...truncated 8707 lines...]
[WARNING] at sun.reflect.NativeMethodAccessorImpl.invoke(NativeMethodAccessorImpl.java:57)
[WARNING] at sun.reflect.DelegatingMethodAccessorImpl.invoke(DelegatingMethodAccessorImpl.java:43)
[WARNING] at java.lang.reflect.Method.invoke(Method.java:606)
[WARNING] at com.sun.tools.javadoc.DocletInvoker.invoke(DocletInvoker.java:280)
[WARNING] at com.sun.tools.javadoc.DocletInvoker.start(DocletInvoker.java:160)
[WARNING] at com.sun.tools.javadoc.Start.parseAndExecute(Start.java:397)
[WARNING] at com.sun.tools.javadoc.Start.begin(Start.java:167)
[WARNING] at com.sun.tools.javadoc.Main.execute(Main.java:59)
[WARNING] at com.sun.tools.javadoc.Main.main(Main.java:49)
[INFO] Building jar: /home/jenkins/jenkins-slave/workspace/Hadoop-Yarn-trunk/hadoop-yarn-project/hadoop-yarn/hadoop-yarn-server/hadoop-yarn-server-web-proxy/target/hadoop-yarn-server-web-proxy-3.0.0-SNAPSHOT-javadoc.jar
[INFO] 
[INFO] --- maven-enforcer-plugin:1.3.1:enforce (depcheck) @ hadoop-yarn-server-web-proxy ---
[INFO] 
[INFO] --- maven-checkstyle-plugin:2.15:checkstyle (default-cli) @ hadoop-yarn-server-web-proxy
---
[INFO] ------------------------------------------------------------------------
[INFO] Reactor Summary:
[INFO] 
[INFO] Apache Hadoop YARN ................................ SUCCESS [  4.515 s]
[INFO] Apache Hadoop YARN API ............................ SUCCESS [05:50 min]
[INFO] Apache Hadoop YARN Common ......................... SUCCESS [04:20 min]
[INFO] Apache Hadoop YARN Server ......................... SUCCESS [  0.166 s]
[INFO] Apache Hadoop YARN Server Common .................. SUCCESS [01:30 min]
[INFO] Apache Hadoop YARN NodeManager .................... SUCCESS [11:19 min]
[INFO] Apache Hadoop YARN Web Proxy ...................... FAILURE [ 19.120 s]
[INFO] Apache Hadoop YARN ApplicationHistoryService ...... SKIPPED
[INFO] Apache Hadoop YARN ResourceManager ................ SKIPPED
[INFO] Apache Hadoop YARN Server Tests ................... SKIPPED
[INFO] Apache Hadoop YARN Client ......................... SKIPPED
[INFO] Apache Hadoop YARN SharedCacheManager ............. SKIPPED
[INFO] Apache Hadoop YARN Timeline Plugin Storage ........ SKIPPED
[INFO] Apache Hadoop YARN Applications ................... SKIPPED
[INFO] Apache Hadoop YARN DistributedShell ............... SKIPPED
[INFO] Apache Hadoop YARN Unmanaged Am Launcher .......... SKIPPED
[INFO] Apache Hadoop YARN Site ........................... SKIPPED
[INFO] Apache Hadoop YARN Registry ....................... SKIPPED
[INFO] Apache Hadoop YARN Project ........................ SKIPPED
[INFO] ------------------------------------------------------------------------
[INFO] BUILD FAILURE
[INFO] ------------------------------------------------------------------------
[INFO] Total time: 23:26 min
[INFO] Finished at: 2016-02-25T03:55:57+00:00
[INFO] Final Memory: 85M/958M
[INFO] ------------------------------------------------------------------------
[ERROR] Failed to execute goal org.apache.maven.plugins:maven-checkstyle-plugin:2.15:checkstyle
(default-cli) on project hadoop-yarn-server-web-proxy: An error has occurred in Checkstyle
report generation. Failed during checkstyle execution: Unable to process configuration file
at location: checkstyle/checkstyle.xml: Cannot create file-based resource:invalid block type
-> [Help 1]
[ERROR] 
[ERROR] To see the full stack trace of the errors, re-run Maven with the -e switch.
[ERROR] Re-run Maven using the -X switch to enable full debug logging.
[ERROR] 
[ERROR] For more information about the errors and possible solutions, please read the following
articles:
[ERROR] [Help 1] http://cwiki.apache.org/confluence/display/MAVEN/MojoExecutionException
[ERROR] 
[ERROR] After correcting the problems, you can resume the build with the command
[ERROR]   mvn <goals> -rf :hadoop-yarn-server-web-proxy
Build step 'Execute shell' marked build as failure
Archiving artifacts
Recording test results
Sending e-mails to: yarn-dev@hadoop.apache.org
Email was triggered for: Failure - Any
Sending email for trigger: Failure - Any



###################################################################################
############################## FAILED TESTS (if any) ##############################
All tests passed
Mime
  • Unnamed multipart/mixed (inline, None, 0 bytes)
View raw message