hadoop-yarn-dev mailing list archives

Site index · List index
Message view « Date » · « Thread »
Top « Date » · « Thread »
From Apache Jenkins Server <jenk...@builds.apache.org>
Subject Build failed in Jenkins: Hadoop-Yarn-trunk #1703
Date Mon, 01 Feb 2016 09:17:24 GMT
See <https://builds.apache.org/job/Hadoop-Yarn-trunk/1703/changes>

Changes:

[vinayakumarb] HDFS-9566. Remove expensive 'BlocksMap#getStorages(Block b, final

[vinayakumarb] HDFS-9659. EditLogTailerThread to Active Namenode RPC should timeout

------------------------------------------
[...truncated 7567 lines...]
[INFO] --- maven-resources-plugin:2.6:resources (default-resources) @ hadoop-yarn-server-nodemanager
---
[INFO] Using 'UTF-8' encoding to copy filtered resources.
[INFO] Copying 3 resources
[INFO] 
[INFO] --- maven-compiler-plugin:3.1:compile (default-compile) @ hadoop-yarn-server-nodemanager
---
[INFO] Changes detected - recompiling the module!
[INFO] Compiling 219 source files to <https://builds.apache.org/job/Hadoop-Yarn-trunk/ws/hadoop-yarn-project/hadoop-yarn/hadoop-yarn-server/hadoop-yarn-server-nodemanager/target/classes>
[WARNING] <https://builds.apache.org/job/Hadoop-Yarn-trunk/ws/hadoop-yarn-project/hadoop-yarn/hadoop-yarn-server/hadoop-yarn-server-nodemanager/src/main/java/org/apache/hadoop/yarn/server/nodemanager/util/DefaultLCEResourcesHandler.java>:
Some input files use or override a deprecated API.
[WARNING] <https://builds.apache.org/job/Hadoop-Yarn-trunk/ws/hadoop-yarn-project/hadoop-yarn/hadoop-yarn-server/hadoop-yarn-server-nodemanager/src/main/java/org/apache/hadoop/yarn/server/nodemanager/util/DefaultLCEResourcesHandler.java>:
Recompile with -Xlint:deprecation for details.
[WARNING] <https://builds.apache.org/job/Hadoop-Yarn-trunk/ws/hadoop-yarn-project/hadoop-yarn/hadoop-yarn-server/hadoop-yarn-server-nodemanager/src/main/java/org/apache/hadoop/yarn/server/nodemanager/containermanager/monitor/ContainersMonitorImpl.java>:
Some input files use unchecked or unsafe operations.
[WARNING] <https://builds.apache.org/job/Hadoop-Yarn-trunk/ws/hadoop-yarn-project/hadoop-yarn/hadoop-yarn-server/hadoop-yarn-server-nodemanager/src/main/java/org/apache/hadoop/yarn/server/nodemanager/containermanager/monitor/ContainersMonitorImpl.java>:
Recompile with -Xlint:unchecked for details.
[INFO] 
[INFO] --- hadoop-maven-plugins:3.0.0-SNAPSHOT:cmake-compile (cmake-compile) @ hadoop-yarn-server-nodemanager
---
[INFO] mkdirs '<https://builds.apache.org/job/Hadoop-Yarn-trunk/ws/hadoop-yarn-project/hadoop-yarn/hadoop-yarn-server/hadoop-yarn-server-nodemanager/target/native'>
[INFO] Running cmake <https://builds.apache.org/job/Hadoop-Yarn-trunk/ws/hadoop-yarn-project/hadoop-yarn/hadoop-yarn-server/hadoop-yarn-server-nodemanager/src>
-DHADOOP_CONF_DIR=../etc/hadoop -DJVM_ARCH_DATA_MODEL=64 -G Unix Makefiles
[INFO] with extra environment variables {
  CFLAGS = ''
}
[INFO] Running make -j 16 VERBOSE=1
[WARNING] <https://builds.apache.org/job/Hadoop-Yarn-trunk/ws/hadoop-yarn-project/hadoop-yarn/hadoop-yarn-server/hadoop-yarn-server-nodemanager/src/main/native/container-executor/impl/main.c>:
In function ‘assert_valid_setup’:
[WARNING] <https://builds.apache.org/job/Hadoop-Yarn-trunk/ws/hadoop-yarn-project/hadoop-yarn/hadoop-yarn-server/hadoop-yarn-server-nodemanager/src/main/native/container-executor/impl/main.c>:134:9:
warning: ignoring return value of ‘setuid’, declared with attribute warn_unused_result
[-Wunused-result]
[WARNING]    setuid(0);
[WARNING]          ^
[WARNING] <https://builds.apache.org/job/Hadoop-Yarn-trunk/ws/hadoop-yarn-project/hadoop-yarn/hadoop-yarn-server/hadoop-yarn-server-nodemanager/src/main/native/container-executor/impl/main.c>:136:9:
warning: ignoring return value of ‘setgid’, declared with attribute warn_unused_result
[-Wunused-result]
[WARNING]    setgid(group_info->gr_gid);
[WARNING]          ^
[WARNING] <https://builds.apache.org/job/Hadoop-Yarn-trunk/ws/hadoop-yarn-project/hadoop-yarn/hadoop-yarn-server/hadoop-yarn-server-nodemanager/src/main/native/container-executor/test/test-container-executor.c>:
In function ‘main’:
[WARNING] <https://builds.apache.org/job/Hadoop-Yarn-trunk/ws/hadoop-yarn-project/hadoop-yarn/hadoop-yarn-server/hadoop-yarn-server-nodemanager/src/main/native/container-executor/test/test-container-executor.c>:846:10:
warning: ignoring return value of ‘seteuid’, declared with attribute warn_unused_result
[-Wunused-result]
[WARNING]    seteuid(0);
[WARNING]           ^
[INFO] Running make -j 16 VERBOSE=1
[INFO] cmake compilation finished successfully in 2001 millisecond(s).
[INFO] 
[INFO] --- maven-resources-plugin:2.6:testResources (default-testResources) @ hadoop-yarn-server-nodemanager
---
[INFO] Using 'UTF-8' encoding to copy filtered resources.
[INFO] Copying 5 resources
[INFO] 
[INFO] --- maven-compiler-plugin:3.1:testCompile (default-testCompile) @ hadoop-yarn-server-nodemanager
---
[INFO] Changes detected - recompiling the module!
[INFO] Compiling 87 source files to <https://builds.apache.org/job/Hadoop-Yarn-trunk/ws/hadoop-yarn-project/hadoop-yarn/hadoop-yarn-server/hadoop-yarn-server-nodemanager/target/test-classes>
[WARNING] <https://builds.apache.org/job/Hadoop-Yarn-trunk/ws/hadoop-yarn-project/hadoop-yarn/hadoop-yarn-server/hadoop-yarn-server-nodemanager/src/test/java/org/apache/hadoop/yarn/server/nodemanager/TestLinuxContainerExecutor.java>:
Some input files use or override a deprecated API.
[WARNING] <https://builds.apache.org/job/Hadoop-Yarn-trunk/ws/hadoop-yarn-project/hadoop-yarn/hadoop-yarn-server/hadoop-yarn-server-nodemanager/src/test/java/org/apache/hadoop/yarn/server/nodemanager/TestLinuxContainerExecutor.java>:
Recompile with -Xlint:deprecation for details.
[WARNING] <https://builds.apache.org/job/Hadoop-Yarn-trunk/ws/hadoop-yarn-project/hadoop-yarn/hadoop-yarn-server/hadoop-yarn-server-nodemanager/src/test/java/org/apache/hadoop/yarn/server/nodemanager/containermanager/logaggregation/TestLogAggregationService.java>:
<https://builds.apache.org/job/Hadoop-Yarn-trunk/ws/hadoop-yarn-project/hadoop-yarn/hadoop-yarn-server/hadoop-yarn-server-nodemanager/src/test/java/org/apache/hadoop/yarn/server/nodemanager/containermanager/logaggregation/TestLogAggregationService.java>
uses unchecked or unsafe operations.
[WARNING] <https://builds.apache.org/job/Hadoop-Yarn-trunk/ws/hadoop-yarn-project/hadoop-yarn/hadoop-yarn-server/hadoop-yarn-server-nodemanager/src/test/java/org/apache/hadoop/yarn/server/nodemanager/containermanager/logaggregation/TestLogAggregationService.java>:
Recompile with -Xlint:unchecked for details.
[INFO] 
[INFO] --- maven-surefire-plugin:2.17:test (default-test) @ hadoop-yarn-server-nodemanager
---
[INFO] Surefire report directory: <https://builds.apache.org/job/Hadoop-Yarn-trunk/ws/hadoop-yarn-project/hadoop-yarn/hadoop-yarn-server/hadoop-yarn-server-nodemanager/target/surefire-reports>

-------------------------------------------------------
 T E S T S
-------------------------------------------------------

-------------------------------------------------------
 T E S T S
-------------------------------------------------------
Running org.apache.hadoop.yarn.server.nodemanager.TestNMAuditLogger
Tests run: 3, Failures: 0, Errors: 0, Skipped: 0, Time elapsed: 1.174 sec - in org.apache.hadoop.yarn.server.nodemanager.TestNMAuditLogger
Running org.apache.hadoop.yarn.server.nodemanager.TestDefaultContainerExecutor
Tests run: 3, Failures: 0, Errors: 0, Skipped: 0, Time elapsed: 12.056 sec - in org.apache.hadoop.yarn.server.nodemanager.TestDefaultContainerExecutor
Running org.apache.hadoop.yarn.server.nodemanager.TestDirectoryCollection
Tests run: 7, Failures: 0, Errors: 0, Skipped: 0, Time elapsed: 1.111 sec - in org.apache.hadoop.yarn.server.nodemanager.TestDirectoryCollection
Running org.apache.hadoop.yarn.server.nodemanager.TestDeletionService
Tests run: 6, Failures: 0, Errors: 0, Skipped: 0, Time elapsed: 23.468 sec - in org.apache.hadoop.yarn.server.nodemanager.TestDeletionService
Running org.apache.hadoop.yarn.server.nodemanager.TestDockerContainerExecutor
Tests run: 1, Failures: 0, Errors: 0, Skipped: 0, Time elapsed: 15.647 sec - in org.apache.hadoop.yarn.server.nodemanager.TestDockerContainerExecutor
Running org.apache.hadoop.yarn.server.nodemanager.TestNodeStatusUpdater
Tests run: 17, Failures: 0, Errors: 0, Skipped: 0, Time elapsed: 75.309 sec - in org.apache.hadoop.yarn.server.nodemanager.TestNodeStatusUpdater
Running org.apache.hadoop.yarn.server.nodemanager.TestContainerExecutor
Tests run: 5, Failures: 0, Errors: 0, Skipped: 3, Time elapsed: 1.05 sec - in org.apache.hadoop.yarn.server.nodemanager.TestContainerExecutor
Running org.apache.hadoop.yarn.server.nodemanager.containermanager.TestContainerManagerRecovery
Tests run: 3, Failures: 0, Errors: 0, Skipped: 0, Time elapsed: 32.447 sec - in org.apache.hadoop.yarn.server.nodemanager.containermanager.TestContainerManagerRecovery
Running org.apache.hadoop.yarn.server.nodemanager.containermanager.TestContainerManager
Tests run: 16, Failures: 0, Errors: 0, Skipped: 0, Time elapsed: 42.547 sec - in org.apache.hadoop.yarn.server.nodemanager.containermanager.TestContainerManager
Running org.apache.hadoop.yarn.server.nodemanager.containermanager.TestNMProxy
Tests run: 3, Failures: 0, Errors: 0, Skipped: 0, Time elapsed: 4.841 sec - in org.apache.hadoop.yarn.server.nodemanager.containermanager.TestNMProxy
Running org.apache.hadoop.yarn.server.nodemanager.containermanager.linux.resources.TestCGroupsHandlerImpl
Tests run: 4, Failures: 0, Errors: 0, Skipped: 0, Time elapsed: 1.159 sec - in org.apache.hadoop.yarn.server.nodemanager.containermanager.linux.resources.TestCGroupsHandlerImpl
Running org.apache.hadoop.yarn.server.nodemanager.containermanager.linux.resources.TestCGroupsBlkioResourceHandlerImpl
Tests run: 5, Failures: 0, Errors: 0, Skipped: 0, Time elapsed: 0.564 sec - in org.apache.hadoop.yarn.server.nodemanager.containermanager.linux.resources.TestCGroupsBlkioResourceHandlerImpl
Running org.apache.hadoop.yarn.server.nodemanager.containermanager.linux.resources.TestTrafficControlBandwidthHandlerImpl
Tests run: 2, Failures: 0, Errors: 0, Skipped: 0, Time elapsed: 1.059 sec - in org.apache.hadoop.yarn.server.nodemanager.containermanager.linux.resources.TestTrafficControlBandwidthHandlerImpl
Running org.apache.hadoop.yarn.server.nodemanager.containermanager.linux.resources.TestTrafficController
Tests run: 5, Failures: 0, Errors: 0, Skipped: 0, Time elapsed: 1.134 sec - in org.apache.hadoop.yarn.server.nodemanager.containermanager.linux.resources.TestTrafficController
Running org.apache.hadoop.yarn.server.nodemanager.containermanager.linux.resources.TestCGroupsCpuResourceHandlerImpl
Tests run: 10, Failures: 0, Errors: 0, Skipped: 0, Time elapsed: 1.187 sec - in org.apache.hadoop.yarn.server.nodemanager.containermanager.linux.resources.TestCGroupsCpuResourceHandlerImpl
Running org.apache.hadoop.yarn.server.nodemanager.containermanager.linux.resources.TestResourceHandlerModule
Tests run: 2, Failures: 0, Errors: 0, Skipped: 0, Time elapsed: 0.851 sec - in org.apache.hadoop.yarn.server.nodemanager.containermanager.linux.resources.TestResourceHandlerModule
Running org.apache.hadoop.yarn.server.nodemanager.containermanager.linux.resources.TestCGroupsMemoryResourceHandlerImpl
Tests run: 6, Failures: 0, Errors: 0, Skipped: 0, Time elapsed: 1.068 sec - in org.apache.hadoop.yarn.server.nodemanager.containermanager.linux.resources.TestCGroupsMemoryResourceHandlerImpl
Running org.apache.hadoop.yarn.server.nodemanager.containermanager.linux.runtime.TestDockerContainerRuntime
Tests run: 8, Failures: 0, Errors: 0, Skipped: 0, Time elapsed: 1.541 sec - in org.apache.hadoop.yarn.server.nodemanager.containermanager.linux.runtime.TestDockerContainerRuntime
Running org.apache.hadoop.yarn.server.nodemanager.containermanager.linux.privileged.TestPrivilegedOperationExecutor
Tests run: 4, Failures: 0, Errors: 0, Skipped: 0, Time elapsed: 0.864 sec - in org.apache.hadoop.yarn.server.nodemanager.containermanager.linux.privileged.TestPrivilegedOperationExecutor
Running org.apache.hadoop.yarn.server.nodemanager.containermanager.container.TestContainer
Tests run: 20, Failures: 0, Errors: 0, Skipped: 0, Time elapsed: 2.75 sec - in org.apache.hadoop.yarn.server.nodemanager.containermanager.container.TestContainer
Running org.apache.hadoop.yarn.server.nodemanager.containermanager.TestAuxServices
Tests run: 6, Failures: 0, Errors: 0, Skipped: 0, Time elapsed: 1.246 sec - in org.apache.hadoop.yarn.server.nodemanager.containermanager.TestAuxServices
Running org.apache.hadoop.yarn.server.nodemanager.containermanager.loghandler.TestNonAggregatingLogHandler
Tests run: 6, Failures: 0, Errors: 0, Skipped: 0, Time elapsed: 2.069 sec - in org.apache.hadoop.yarn.server.nodemanager.containermanager.loghandler.TestNonAggregatingLogHandler
Running org.apache.hadoop.yarn.server.nodemanager.containermanager.launcher.TestContainerLaunch
Tests run: 23, Failures: 0, Errors: 0, Skipped: 5, Time elapsed: 22.45 sec - in org.apache.hadoop.yarn.server.nodemanager.containermanager.launcher.TestContainerLaunch
Running org.apache.hadoop.yarn.server.nodemanager.containermanager.logaggregation.TestLogAggregationService
Tests run: 35, Failures: 0, Errors: 0, Skipped: 0, Time elapsed: 116.316 sec - in org.apache.hadoop.yarn.server.nodemanager.containermanager.logaggregation.TestLogAggregationService
Running org.apache.hadoop.yarn.server.nodemanager.containermanager.monitor.TestContainersMonitor
Tests run: 3, Failures: 0, Errors: 0, Skipped: 0, Time elapsed: 7.821 sec - in org.apache.hadoop.yarn.server.nodemanager.containermanager.monitor.TestContainersMonitor
Running org.apache.hadoop.yarn.server.nodemanager.containermanager.monitor.TestContainersMonitorResourceChange
Tests run: 2, Failures: 0, Errors: 0, Skipped: 0, Time elapsed: 2.837 sec - in org.apache.hadoop.yarn.server.nodemanager.containermanager.monitor.TestContainersMonitorResourceChange
Running org.apache.hadoop.yarn.server.nodemanager.containermanager.monitor.TestContainerMetrics
Tests run: 3, Failures: 0, Errors: 0, Skipped: 0, Time elapsed: 1.512 sec - in org.apache.hadoop.yarn.server.nodemanager.containermanager.monitor.TestContainerMetrics
Running org.apache.hadoop.yarn.server.nodemanager.containermanager.application.TestApplication
Tests run: 8, Failures: 0, Errors: 0, Skipped: 0, Time elapsed: 5.815 sec - in org.apache.hadoop.yarn.server.nodemanager.containermanager.application.TestApplication
Running org.apache.hadoop.yarn.server.nodemanager.containermanager.localizer.TestLocalizedResource
Tests run: 1, Failures: 0, Errors: 0, Skipped: 0, Time elapsed: 0.716 sec - in org.apache.hadoop.yarn.server.nodemanager.containermanager.localizer.TestLocalizedResource
Running org.apache.hadoop.yarn.server.nodemanager.containermanager.localizer.TestContainerLocalizer
Tests run: 3, Failures: 0, Errors: 0, Skipped: 0, Time elapsed: 1.783 sec - in org.apache.hadoop.yarn.server.nodemanager.containermanager.localizer.TestContainerLocalizer
Running org.apache.hadoop.yarn.server.nodemanager.containermanager.localizer.TestLocalCacheDirectoryManager
Tests run: 5, Failures: 0, Errors: 0, Skipped: 0, Time elapsed: 1.752 sec - in org.apache.hadoop.yarn.server.nodemanager.containermanager.localizer.TestLocalCacheDirectoryManager
Running org.apache.hadoop.yarn.server.nodemanager.containermanager.localizer.TestLocalResourcesTrackerImpl
Tests run: 11, Failures: 0, Errors: 0, Skipped: 0, Time elapsed: 1.795 sec - in org.apache.hadoop.yarn.server.nodemanager.containermanager.localizer.TestLocalResourcesTrackerImpl
Running org.apache.hadoop.yarn.server.nodemanager.containermanager.localizer.TestResourceLocalizationService
Tests run: 14, Failures: 0, Errors: 0, Skipped: 0, Time elapsed: 6.903 sec - in org.apache.hadoop.yarn.server.nodemanager.containermanager.localizer.TestResourceLocalizationService
Running org.apache.hadoop.yarn.server.nodemanager.containermanager.localizer.TestLocalResource
Tests run: 2, Failures: 0, Errors: 0, Skipped: 0, Time elapsed: 0.471 sec - in org.apache.hadoop.yarn.server.nodemanager.containermanager.localizer.TestLocalResource
Running org.apache.hadoop.yarn.server.nodemanager.containermanager.localizer.TestResourceRetention
Tests run: 1, Failures: 0, Errors: 0, Skipped: 0, Time elapsed: 1.101 sec - in org.apache.hadoop.yarn.server.nodemanager.containermanager.localizer.TestResourceRetention
Running org.apache.hadoop.yarn.server.nodemanager.containermanager.localizer.sharedcache.TestSharedCacheUploadService
Tests run: 2, Failures: 0, Errors: 0, Skipped: 0, Time elapsed: 1.025 sec - in org.apache.hadoop.yarn.server.nodemanager.containermanager.localizer.sharedcache.TestSharedCacheUploadService
Running org.apache.hadoop.yarn.server.nodemanager.containermanager.localizer.sharedcache.TestSharedCacheUploader
Tests run: 6, Failures: 0, Errors: 0, Skipped: 0, Time elapsed: 1.297 sec - in org.apache.hadoop.yarn.server.nodemanager.containermanager.localizer.sharedcache.TestSharedCacheUploader
Running org.apache.hadoop.yarn.server.nodemanager.TestNodeManagerReboot
Tests run: 1, Failures: 0, Errors: 0, Skipped: 0, Time elapsed: 8.415 sec - in org.apache.hadoop.yarn.server.nodemanager.TestNodeManagerReboot
Running org.apache.hadoop.yarn.server.nodemanager.security.TestNMContainerTokenSecretManager
Tests run: 1, Failures: 0, Errors: 0, Skipped: 0, Time elapsed: 1.58 sec - in org.apache.hadoop.yarn.server.nodemanager.security.TestNMContainerTokenSecretManager
Running org.apache.hadoop.yarn.server.nodemanager.security.TestNMTokenSecretManagerInNM
Tests run: 1, Failures: 0, Errors: 0, Skipped: 0, Time elapsed: 1.27 sec - in org.apache.hadoop.yarn.server.nodemanager.security.TestNMTokenSecretManagerInNM
Running org.apache.hadoop.yarn.server.nodemanager.nodelabels.TestScriptBasedNodeLabelsProvider
Tests run: 3, Failures: 0, Errors: 0, Skipped: 0, Time elapsed: 5.867 sec - in org.apache.hadoop.yarn.server.nodemanager.nodelabels.TestScriptBasedNodeLabelsProvider
Running org.apache.hadoop.yarn.server.nodemanager.nodelabels.TestConfigurationNodeLabelsProvider
Tests run: 3, Failures: 0, Errors: 0, Skipped: 0, Time elapsed: 3.466 sec - in org.apache.hadoop.yarn.server.nodemanager.nodelabels.TestConfigurationNodeLabelsProvider
Running org.apache.hadoop.yarn.server.nodemanager.util.TestCgroupsLCEResourcesHandler
Tests run: 5, Failures: 0, Errors: 0, Skipped: 0, Time elapsed: 1.475 sec - in org.apache.hadoop.yarn.server.nodemanager.util.TestCgroupsLCEResourcesHandler
Running org.apache.hadoop.yarn.server.nodemanager.util.TestProcessIdFileReader
Tests run: 3, Failures: 0, Errors: 0, Skipped: 0, Time elapsed: 0.218 sec - in org.apache.hadoop.yarn.server.nodemanager.util.TestProcessIdFileReader
Running org.apache.hadoop.yarn.server.nodemanager.util.TestNodeManagerHardwareUtils
Tests run: 3, Failures: 0, Errors: 0, Skipped: 0, Time elapsed: 1.07 sec - in org.apache.hadoop.yarn.server.nodemanager.util.TestNodeManagerHardwareUtils
Running org.apache.hadoop.yarn.server.nodemanager.TestDockerContainerExecutorWithMocks
Tests run: 4, Failures: 0, Errors: 0, Skipped: 0, Time elapsed: 1.548 sec - in org.apache.hadoop.yarn.server.nodemanager.TestDockerContainerExecutorWithMocks
Running org.apache.hadoop.yarn.server.nodemanager.TestLocalDirsHandlerService
Tests run: 3, Failures: 0, Errors: 0, Skipped: 0, Time elapsed: 1.179 sec - in org.apache.hadoop.yarn.server.nodemanager.TestLocalDirsHandlerService
Running org.apache.hadoop.yarn.server.nodemanager.amrmproxy.TestAMRMProxyService
Tests run: 16, Failures: 0, Errors: 0, Skipped: 0, Time elapsed: 2.469 sec - in org.apache.hadoop.yarn.server.nodemanager.amrmproxy.TestAMRMProxyService
Running org.apache.hadoop.yarn.server.nodemanager.TestNodeHealthService
Tests run: 1, Failures: 0, Errors: 0, Skipped: 0, Time elapsed: 1.316 sec - in org.apache.hadoop.yarn.server.nodemanager.TestNodeHealthService
Running org.apache.hadoop.yarn.server.nodemanager.TestLinuxContainerExecutor
Tests run: 8, Failures: 0, Errors: 0, Skipped: 8, Time elapsed: 1.239 sec - in org.apache.hadoop.yarn.server.nodemanager.TestLinuxContainerExecutor
Running org.apache.hadoop.yarn.server.nodemanager.TestNodeResourceMonitor
Tests run: 1, Failures: 0, Errors: 0, Skipped: 0, Time elapsed: 1.925 sec - in org.apache.hadoop.yarn.server.nodemanager.TestNodeResourceMonitor
Running org.apache.hadoop.yarn.server.nodemanager.api.protocolrecords.impl.pb.TestPBLocalizerRPC
Tests run: 1, Failures: 0, Errors: 0, Skipped: 0, Time elapsed: 1.245 sec - in org.apache.hadoop.yarn.server.nodemanager.api.protocolrecords.impl.pb.TestPBLocalizerRPC
Running org.apache.hadoop.yarn.server.nodemanager.api.protocolrecords.impl.pb.TestPBRecordImpl
Tests run: 4, Failures: 0, Errors: 0, Skipped: 0, Time elapsed: 0.678 sec - in org.apache.hadoop.yarn.server.nodemanager.api.protocolrecords.impl.pb.TestPBRecordImpl
Running org.apache.hadoop.yarn.server.nodemanager.webapp.TestNMWebServicesApps
Tests run: 19, Failures: 0, Errors: 0, Skipped: 0, Time elapsed: 9.808 sec - in org.apache.hadoop.yarn.server.nodemanager.webapp.TestNMWebServicesApps
Running org.apache.hadoop.yarn.server.nodemanager.webapp.TestNMWebServer
Tests run: 3, Failures: 0, Errors: 0, Skipped: 0, Time elapsed: 4.673 sec - in org.apache.hadoop.yarn.server.nodemanager.webapp.TestNMWebServer
Running org.apache.hadoop.yarn.server.nodemanager.webapp.TestNMWebServices
Tests run: 11, Failures: 0, Errors: 0, Skipped: 0, Time elapsed: 7.305 sec - in org.apache.hadoop.yarn.server.nodemanager.webapp.TestNMWebServices
Running org.apache.hadoop.yarn.server.nodemanager.webapp.TestContainerLogsPage
Tests run: 5, Failures: 0, Errors: 0, Skipped: 1, Time elapsed: 1.695 sec - in org.apache.hadoop.yarn.server.nodemanager.webapp.TestContainerLogsPage
Running org.apache.hadoop.yarn.server.nodemanager.webapp.TestNMWebServicesContainers
Tests run: 12, Failures: 0, Errors: 0, Skipped: 0, Time elapsed: 7.607 sec - in org.apache.hadoop.yarn.server.nodemanager.webapp.TestNMWebServicesContainers
Running org.apache.hadoop.yarn.server.nodemanager.TestNodeManager
Tests run: 2, Failures: 0, Errors: 0, Skipped: 0, Time elapsed: 1.485 sec - in org.apache.hadoop.yarn.server.nodemanager.TestNodeManager
Running org.apache.hadoop.yarn.server.nodemanager.TestRPCFactories
Tests run: 1, Failures: 0, Errors: 0, Skipped: 0, Time elapsed: 0.944 sec - in org.apache.hadoop.yarn.server.nodemanager.TestRPCFactories
Running org.apache.hadoop.yarn.server.nodemanager.TestLinuxContainerExecutorWithMocks
Tests run: 8, Failures: 0, Errors: 0, Skipped: 0, Time elapsed: 1.577 sec - in org.apache.hadoop.yarn.server.nodemanager.TestLinuxContainerExecutorWithMocks
Running org.apache.hadoop.yarn.server.nodemanager.TestNodeManagerResync
Tests run: 6, Failures: 0, Errors: 0, Skipped: 0, Time elapsed: 31.388 sec - in org.apache.hadoop.yarn.server.nodemanager.TestNodeManagerResync
Running org.apache.hadoop.yarn.server.nodemanager.recovery.TestNMLeveldbStateStoreService
Tests run: 12, Failures: 0, Errors: 0, Skipped: 0, Time elapsed: 2.379 sec - in org.apache.hadoop.yarn.server.nodemanager.recovery.TestNMLeveldbStateStoreService
Running org.apache.hadoop.yarn.server.nodemanager.TestRecordFactory
Tests run: 1, Failures: 0, Errors: 0, Skipped: 0, Time elapsed: 0.264 sec - in org.apache.hadoop.yarn.server.nodemanager.TestRecordFactory
Running org.apache.hadoop.yarn.server.nodemanager.TestContainerManagerWithLCE
Tests run: 16, Failures: 0, Errors: 0, Skipped: 0, Time elapsed: 2.272 sec - in org.apache.hadoop.yarn.server.nodemanager.TestContainerManagerWithLCE
Running org.apache.hadoop.yarn.server.nodemanager.TestEventFlow
Tests run: 1, Failures: 0, Errors: 0, Skipped: 0, Time elapsed: 6.065 sec - in org.apache.hadoop.yarn.server.nodemanager.TestEventFlow
Running org.apache.hadoop.yarn.server.nodemanager.metrics.TestNodeManagerMetrics
Tests run: 1, Failures: 0, Errors: 0, Skipped: 0, Time elapsed: 0.938 sec - in org.apache.hadoop.yarn.server.nodemanager.metrics.TestNodeManagerMetrics
Running org.apache.hadoop.yarn.server.nodemanager.TestNodeStatusUpdaterForLabels
Tests run: 2, Failures: 0, Errors: 0, Skipped: 0, Time elapsed: 10.059 sec - in org.apache.hadoop.yarn.server.nodemanager.TestNodeStatusUpdaterForLabels
Running org.apache.hadoop.yarn.server.nodemanager.TestNodeManagerShutdown
Tests run: 2, Failures: 0, Errors: 0, Skipped: 0, Time elapsed: 8.157 sec - in org.apache.hadoop.yarn.server.nodemanager.TestNodeManagerShutdown

Results :

Tests run: 421, Failures: 0, Errors: 0, Skipped: 17

[INFO] 
[INFO] --- hadoop-maven-plugins:3.0.0-SNAPSHOT:cmake-test (test-container-executor) @ hadoop-yarn-server-nodemanager
---
[INFO] -------------------------------------------------------
[INFO]  C M A K E B U I L D E R    T E S T
[INFO] -------------------------------------------------------
[INFO] test-container-executor: running <https://builds.apache.org/job/Hadoop-Yarn-trunk/ws/hadoop-yarn-project/hadoop-yarn/hadoop-yarn-server/hadoop-yarn-server-nodemanager/target/native/target/usr/local/bin/test-container-executor>
[INFO] with extra environment variables {}
[INFO] STATUS: ERROR CODE 1 after 13 millisecond(s).
[INFO] -------------------------------------------------------
[INFO] ------------------------------------------------------------------------
[INFO] Reactor Summary:
[INFO] 
[INFO] Apache Hadoop YARN ................................ SUCCESS [  3.983 s]
[INFO] Apache Hadoop YARN API ............................ SUCCESS [04:39 min]
[INFO] Apache Hadoop YARN Common ......................... SUCCESS [03:24 min]
[INFO] Apache Hadoop YARN Server ......................... SUCCESS [  0.115 s]
[INFO] Apache Hadoop YARN Server Common .................. SUCCESS [ 51.271 s]
[INFO] Apache Hadoop YARN NodeManager .................... FAILURE [09:15 min]
[INFO] Apache Hadoop YARN Web Proxy ...................... SKIPPED
[INFO] Apache Hadoop YARN ApplicationHistoryService ...... SKIPPED
[INFO] Apache Hadoop YARN ResourceManager ................ SKIPPED
[INFO] Apache Hadoop YARN Server Tests ................... SKIPPED
[INFO] Apache Hadoop YARN Client ......................... SKIPPED
[INFO] Apache Hadoop YARN SharedCacheManager ............. SKIPPED
[INFO] Apache Hadoop YARN Timeline Plugin Storage ........ SKIPPED
[INFO] Apache Hadoop YARN Applications ................... SKIPPED
[INFO] Apache Hadoop YARN DistributedShell ............... SKIPPED
[INFO] Apache Hadoop YARN Unmanaged Am Launcher .......... SKIPPED
[INFO] Apache Hadoop YARN Site ........................... SKIPPED
[INFO] Apache Hadoop YARN Registry ....................... SKIPPED
[INFO] Apache Hadoop YARN Project ........................ SKIPPED
[INFO] ------------------------------------------------------------------------
[INFO] BUILD FAILURE
[INFO] ------------------------------------------------------------------------
[INFO] Total time: 18:17 min
[INFO] Finished at: 2016-02-01T09:17:22+00:00
[INFO] Final Memory: 75M/936M
[INFO] ------------------------------------------------------------------------
[ERROR] Failed to execute goal org.apache.hadoop:hadoop-maven-plugins:3.0.0-SNAPSHOT:cmake-test
(test-container-executor) on project hadoop-yarn-server-nodemanager: Test <https://builds.apache.org/job/Hadoop-Yarn-trunk/ws/hadoop-yarn-project/hadoop-yarn/hadoop-yarn-server/hadoop-yarn-server-nodemanager/target/native/target/usr/local/bin/test-container-executor>
returned ERROR CODE 1 -> [Help 1]
[ERROR] 
[ERROR] To see the full stack trace of the errors, re-run Maven with the -e switch.
[ERROR] Re-run Maven using the -X switch to enable full debug logging.
[ERROR] 
[ERROR] For more information about the errors and possible solutions, please read the following
articles:
[ERROR] [Help 1] http://cwiki.apache.org/confluence/display/MAVEN/MojoExecutionException
[ERROR] 
[ERROR] After correcting the problems, you can resume the build with the command
[ERROR]   mvn <goals> -rf :hadoop-yarn-server-nodemanager
Build step 'Execute shell' marked build as failure
Archiving artifacts
Recording test results

Mime
View raw message