hadoop-yarn-dev mailing list archives

Site index · List index
Message view « Date » · « Thread »
Top « Date » · « Thread »
From Apache Jenkins Server <jenk...@builds.apache.org>
Subject Build failed in Jenkins: Hadoop-Yarn-trunk-Java8 #1072
Date Thu, 18 Feb 2016 05:48:35 GMT
See <https://builds.apache.org/job/Hadoop-Yarn-trunk-Java8/1072/changes>

Changes:

[sjlee] YARN-4690. Skip object allocation in FSAppAttempt#getResourceUsage when

------------------------------------------
[...truncated 3877 lines...]
Tests run: 1, Failures: 0, Errors: 0, Skipped: 0, Time elapsed: 1.2 sec - in org.apache.hadoop.yarn.api.TestNodeId
Java HotSpot(TM) 64-Bit Server VM warning: ignoring option MaxPermSize=768m; support was removed
in 8.0
Running org.apache.hadoop.yarn.api.TestPBImplRecords
Tests run: 121, Failures: 0, Errors: 0, Skipped: 5, Time elapsed: 3.525 sec - in org.apache.hadoop.yarn.api.TestPBImplRecords
Java HotSpot(TM) 64-Bit Server VM warning: ignoring option MaxPermSize=768m; support was removed
in 8.0
Running org.apache.hadoop.yarn.api.TestGetApplicationsRequest
Tests run: 1, Failures: 0, Errors: 0, Skipped: 0, Time elapsed: 1.441 sec - in org.apache.hadoop.yarn.api.TestGetApplicationsRequest
Java HotSpot(TM) 64-Bit Server VM warning: ignoring option MaxPermSize=768m; support was removed
in 8.0
Running org.apache.hadoop.yarn.api.TestContainerId
Tests run: 1, Failures: 0, Errors: 0, Skipped: 0, Time elapsed: 0.966 sec - in org.apache.hadoop.yarn.api.TestContainerId
Java HotSpot(TM) 64-Bit Server VM warning: ignoring option MaxPermSize=768m; support was removed
in 8.0
Running org.apache.hadoop.yarn.api.TestApplicationAttemptId
Tests run: 1, Failures: 0, Errors: 0, Skipped: 0, Time elapsed: 0.939 sec - in org.apache.hadoop.yarn.api.TestApplicationAttemptId
Java HotSpot(TM) 64-Bit Server VM warning: ignoring option MaxPermSize=768m; support was removed
in 8.0
Running org.apache.hadoop.yarn.TestYarnUncaughtExceptionHandler
Exception: org.apache.hadoop.util.ExitUtil$ExitException thrown from the UncaughtExceptionHandler
in thread "Thread-0"
Exception: org.apache.hadoop.util.ExitUtil$HaltException thrown from the UncaughtExceptionHandler
in thread "Thread-3"
Tests run: 3, Failures: 0, Errors: 0, Skipped: 0, Time elapsed: 0.733 sec - in org.apache.hadoop.yarn.TestYarnUncaughtExceptionHandler
Java HotSpot(TM) 64-Bit Server VM warning: ignoring option MaxPermSize=768m; support was removed
in 8.0
Running org.apache.hadoop.yarn.TestRPC
Tests run: 2, Failures: 0, Errors: 0, Skipped: 0, Time elapsed: 3.276 sec - in org.apache.hadoop.yarn.TestRPC
Java HotSpot(TM) 64-Bit Server VM warning: ignoring option MaxPermSize=768m; support was removed
in 8.0
Running org.apache.hadoop.yarn.conf.TestHAUtil
Tests run: 4, Failures: 0, Errors: 0, Skipped: 0, Time elapsed: 1.833 sec - in org.apache.hadoop.yarn.conf.TestHAUtil
Java HotSpot(TM) 64-Bit Server VM warning: ignoring option MaxPermSize=768m; support was removed
in 8.0
Running org.apache.hadoop.yarn.conf.TestYarnConfiguration
Tests run: 5, Failures: 0, Errors: 0, Skipped: 0, Time elapsed: 2.449 sec - in org.apache.hadoop.yarn.conf.TestYarnConfiguration
Java HotSpot(TM) 64-Bit Server VM warning: ignoring option MaxPermSize=768m; support was removed
in 8.0
Running org.apache.hadoop.yarn.TestRecordFactory
Tests run: 1, Failures: 0, Errors: 0, Skipped: 0, Time elapsed: 0.919 sec - in org.apache.hadoop.yarn.TestRecordFactory
Java HotSpot(TM) 64-Bit Server VM warning: ignoring option MaxPermSize=768m; support was removed
in 8.0
Running org.apache.hadoop.yarn.nodelabels.TestCommonNodeLabelsManager
Tests run: 16, Failures: 0, Errors: 0, Skipped: 0, Time elapsed: 2.924 sec - in org.apache.hadoop.yarn.nodelabels.TestCommonNodeLabelsManager
Java HotSpot(TM) 64-Bit Server VM warning: ignoring option MaxPermSize=768m; support was removed
in 8.0
Running org.apache.hadoop.yarn.nodelabels.TestFileSystemNodeLabelsStore
Tests run: 10, Failures: 0, Errors: 0, Skipped: 0, Time elapsed: 4.873 sec - in org.apache.hadoop.yarn.nodelabels.TestFileSystemNodeLabelsStore
Java HotSpot(TM) 64-Bit Server VM warning: ignoring option MaxPermSize=768m; support was removed
in 8.0
Running org.apache.hadoop.yarn.logaggregation.TestAggregatedLogDeletionService
Tests run: 3, Failures: 1, Errors: 0, Skipped: 0, Time elapsed: 4.807 sec <<< FAILURE!
- in org.apache.hadoop.yarn.logaggregation.TestAggregatedLogDeletionService
testRefreshLogRetentionSettings(org.apache.hadoop.yarn.logaggregation.TestAggregatedLogDeletionService)
 Time elapsed: 2.317 sec  <<< FAILURE!
org.mockito.exceptions.verification.junit.ArgumentsAreDifferent: 
Argument(s) are different! Wanted:
fileSystem.delete(
    mockfs://foo/tmp/logs/me/logs/application_1455774365290_0002,
    true
);
-> at org.apache.hadoop.yarn.logaggregation.TestAggregatedLogDeletionService.testRefreshLogRetentionSettings(TestAggregatedLogDeletionService.java:300)
Actual invocation has different arguments:
fileSystem.delete(
    mockfs://foo/tmp/logs/me/logs/application_1455774365150_0001,
    true
);
-> at org.apache.hadoop.fs.FilterFileSystem.delete(FilterFileSystem.java:245)

	at sun.reflect.NativeConstructorAccessorImpl.newInstance0(Native Method)
	at sun.reflect.NativeConstructorAccessorImpl.newInstance(NativeConstructorAccessorImpl.java:62)
	at sun.reflect.DelegatingConstructorAccessorImpl.newInstance(DelegatingConstructorAccessorImpl.java:45)
	at java.lang.reflect.Constructor.newInstance(Constructor.java:408)
	at org.apache.hadoop.yarn.logaggregation.TestAggregatedLogDeletionService.testRefreshLogRetentionSettings(TestAggregatedLogDeletionService.java:300)

Java HotSpot(TM) 64-Bit Server VM warning: ignoring option MaxPermSize=768m; support was removed
in 8.0
Running org.apache.hadoop.yarn.logaggregation.TestAggregatedLogFormat
Tests run: 3, Failures: 0, Errors: 0, Skipped: 1, Time elapsed: 3.681 sec - in org.apache.hadoop.yarn.logaggregation.TestAggregatedLogFormat
Java HotSpot(TM) 64-Bit Server VM warning: ignoring option MaxPermSize=768m; support was removed
in 8.0
Running org.apache.hadoop.yarn.logaggregation.TestAggregatedLogsBlock
Tests run: 5, Failures: 0, Errors: 0, Skipped: 0, Time elapsed: 3.08 sec - in org.apache.hadoop.yarn.logaggregation.TestAggregatedLogsBlock
Java HotSpot(TM) 64-Bit Server VM warning: ignoring option MaxPermSize=768m; support was removed
in 8.0
Running org.apache.hadoop.yarn.event.TestAsyncDispatcher
Tests run: 2, Failures: 0, Errors: 0, Skipped: 0, Time elapsed: 3.659 sec - in org.apache.hadoop.yarn.event.TestAsyncDispatcher
Java HotSpot(TM) 64-Bit Server VM warning: ignoring option MaxPermSize=768m; support was removed
in 8.0
Running org.apache.hadoop.yarn.TestContainerResourceIncreaseRPC
Tests run: 1, Failures: 0, Errors: 0, Skipped: 0, Time elapsed: 5.43 sec - in org.apache.hadoop.yarn.TestContainerResourceIncreaseRPC
Java HotSpot(TM) 64-Bit Server VM warning: ignoring option MaxPermSize=768m; support was removed
in 8.0
Running org.apache.hadoop.yarn.TestContainerLaunchRPC
Tests run: 1, Failures: 0, Errors: 0, Skipped: 0, Time elapsed: 5.688 sec - in org.apache.hadoop.yarn.TestContainerLaunchRPC
Java HotSpot(TM) 64-Bit Server VM warning: ignoring option MaxPermSize=768m; support was removed
in 8.0
Running org.apache.hadoop.yarn.server.security.TestApplicationACLsManager
Tests run: 3, Failures: 0, Errors: 0, Skipped: 0, Time elapsed: 1.951 sec - in org.apache.hadoop.yarn.server.security.TestApplicationACLsManager
Java HotSpot(TM) 64-Bit Server VM warning: ignoring option MaxPermSize=768m; support was removed
in 8.0
Running org.apache.hadoop.yarn.security.TestYARNTokenIdentifier
Tests run: 8, Failures: 0, Errors: 0, Skipped: 0, Time elapsed: 1.894 sec - in org.apache.hadoop.yarn.security.TestYARNTokenIdentifier
Java HotSpot(TM) 64-Bit Server VM warning: ignoring option MaxPermSize=768m; support was removed
in 8.0
Running org.apache.hadoop.yarn.client.api.impl.TestTimelineClientForATS1_5
Tests run: 2, Failures: 0, Errors: 0, Skipped: 0, Time elapsed: 7.41 sec - in org.apache.hadoop.yarn.client.api.impl.TestTimelineClientForATS1_5
Java HotSpot(TM) 64-Bit Server VM warning: ignoring option MaxPermSize=768m; support was removed
in 8.0
Running org.apache.hadoop.yarn.client.api.impl.TestTimelineClient
Tests run: 10, Failures: 0, Errors: 0, Skipped: 0, Time elapsed: 21.264 sec - in org.apache.hadoop.yarn.client.api.impl.TestTimelineClient
Java HotSpot(TM) 64-Bit Server VM warning: ignoring option MaxPermSize=768m; support was removed
in 8.0
Running org.apache.hadoop.yarn.client.TestClientRMProxy
Tests run: 2, Failures: 0, Errors: 0, Skipped: 0, Time elapsed: 1.459 sec - in org.apache.hadoop.yarn.client.TestClientRMProxy
Java HotSpot(TM) 64-Bit Server VM warning: ignoring option MaxPermSize=768m; support was removed
in 8.0
Running org.apache.hadoop.yarn.util.TestResourceCalculatorProcessTree
Tests run: 2, Failures: 0, Errors: 0, Skipped: 0, Time elapsed: 0.605 sec - in org.apache.hadoop.yarn.util.TestResourceCalculatorProcessTree
Java HotSpot(TM) 64-Bit Server VM warning: ignoring option MaxPermSize=768m; support was removed
in 8.0
Running org.apache.hadoop.yarn.util.TestLog4jWarningErrorMetricsAppender
Tests run: 6, Failures: 0, Errors: 0, Skipped: 0, Time elapsed: 9.6 sec - in org.apache.hadoop.yarn.util.TestLog4jWarningErrorMetricsAppender
Java HotSpot(TM) 64-Bit Server VM warning: ignoring option MaxPermSize=768m; support was removed
in 8.0
Running org.apache.hadoop.yarn.util.TestConverterUtils
Tests run: 9, Failures: 0, Errors: 0, Skipped: 0, Time elapsed: 1.024 sec - in org.apache.hadoop.yarn.util.TestConverterUtils
Java HotSpot(TM) 64-Bit Server VM warning: ignoring option MaxPermSize=768m; support was removed
in 8.0
Running org.apache.hadoop.yarn.util.TestProcfsBasedProcessTree
Tests run: 5, Failures: 0, Errors: 0, Skipped: 0, Time elapsed: 2.742 sec - in org.apache.hadoop.yarn.util.TestProcfsBasedProcessTree
Java HotSpot(TM) 64-Bit Server VM warning: ignoring option MaxPermSize=768m; support was removed
in 8.0
Running org.apache.hadoop.yarn.util.TestAdHocLogDumper
Tests run: 1, Failures: 0, Errors: 0, Skipped: 0, Time elapsed: 2.526 sec - in org.apache.hadoop.yarn.util.TestAdHocLogDumper
Java HotSpot(TM) 64-Bit Server VM warning: ignoring option MaxPermSize=768m; support was removed
in 8.0
Running org.apache.hadoop.yarn.util.TestFSDownload
Tests run: 10, Failures: 0, Errors: 0, Skipped: 1, Time elapsed: 4.763 sec - in org.apache.hadoop.yarn.util.TestFSDownload
Java HotSpot(TM) 64-Bit Server VM warning: ignoring option MaxPermSize=768m; support was removed
in 8.0
Running org.apache.hadoop.yarn.util.TestRackResolver
Tests run: 1, Failures: 0, Errors: 0, Skipped: 0, Time elapsed: 1.076 sec - in org.apache.hadoop.yarn.util.TestRackResolver
Java HotSpot(TM) 64-Bit Server VM warning: ignoring option MaxPermSize=768m; support was removed
in 8.0
Running org.apache.hadoop.yarn.util.resource.TestResources
Tests run: 2, Failures: 0, Errors: 0, Skipped: 0, Time elapsed: 0.942 sec - in org.apache.hadoop.yarn.util.resource.TestResources
Java HotSpot(TM) 64-Bit Server VM warning: ignoring option MaxPermSize=768m; support was removed
in 8.0
Running org.apache.hadoop.yarn.util.resource.TestResourceCalculator
Tests run: 4, Failures: 0, Errors: 0, Skipped: 0, Time elapsed: 1.02 sec - in org.apache.hadoop.yarn.util.resource.TestResourceCalculator
Java HotSpot(TM) 64-Bit Server VM warning: ignoring option MaxPermSize=768m; support was removed
in 8.0
Running org.apache.hadoop.yarn.util.TestApps
Tests run: 1, Failures: 0, Errors: 0, Skipped: 0, Time elapsed: 0.526 sec - in org.apache.hadoop.yarn.util.TestApps
Java HotSpot(TM) 64-Bit Server VM warning: ignoring option MaxPermSize=768m; support was removed
in 8.0
Running org.apache.hadoop.yarn.util.TestRackResolverScriptBasedMapping
Tests run: 1, Failures: 0, Errors: 0, Skipped: 0, Time elapsed: 0.826 sec - in org.apache.hadoop.yarn.util.TestRackResolverScriptBasedMapping
Java HotSpot(TM) 64-Bit Server VM warning: ignoring option MaxPermSize=768m; support was removed
in 8.0
Running org.apache.hadoop.yarn.util.TestTimes
Tests run: 5, Failures: 0, Errors: 0, Skipped: 0, Time elapsed: 0.582 sec - in org.apache.hadoop.yarn.util.TestTimes
Java HotSpot(TM) 64-Bit Server VM warning: ignoring option MaxPermSize=768m; support was removed
in 8.0
Running org.apache.hadoop.yarn.util.TestYarnVersionInfo
Tests run: 1, Failures: 0, Errors: 0, Skipped: 0, Time elapsed: 0.617 sec - in org.apache.hadoop.yarn.util.TestYarnVersionInfo
Java HotSpot(TM) 64-Bit Server VM warning: ignoring option MaxPermSize=768m; support was removed
in 8.0
Running org.apache.hadoop.yarn.util.TestWindowsBasedProcessTree
Tests run: 1, Failures: 0, Errors: 0, Skipped: 0, Time elapsed: 0.593 sec - in org.apache.hadoop.yarn.util.TestWindowsBasedProcessTree
Java HotSpot(TM) 64-Bit Server VM warning: ignoring option MaxPermSize=768m; support was removed
in 8.0
Running org.apache.hadoop.yarn.TestRpcFactoryProvider
Tests run: 1, Failures: 0, Errors: 0, Skipped: 0, Time elapsed: 0.933 sec - in org.apache.hadoop.yarn.TestRpcFactoryProvider
Java HotSpot(TM) 64-Bit Server VM warning: ignoring option MaxPermSize=768m; support was removed
in 8.0
Running org.apache.hadoop.yarn.TestContainerLogAppender
Tests run: 1, Failures: 0, Errors: 0, Skipped: 0, Time elapsed: 0.497 sec - in org.apache.hadoop.yarn.TestContainerLogAppender
Java HotSpot(TM) 64-Bit Server VM warning: ignoring option MaxPermSize=768m; support was removed
in 8.0
Running org.apache.hadoop.yarn.webapp.hamlet.TestParseSelector
Tests run: 5, Failures: 0, Errors: 0, Skipped: 0, Time elapsed: 0.388 sec - in org.apache.hadoop.yarn.webapp.hamlet.TestParseSelector
Java HotSpot(TM) 64-Bit Server VM warning: ignoring option MaxPermSize=768m; support was removed
in 8.0
Running org.apache.hadoop.yarn.webapp.hamlet.TestHamletImpl
Tests run: 4, Failures: 0, Errors: 0, Skipped: 0, Time elapsed: 1.321 sec - in org.apache.hadoop.yarn.webapp.hamlet.TestHamletImpl
Java HotSpot(TM) 64-Bit Server VM warning: ignoring option MaxPermSize=768m; support was removed
in 8.0
Running org.apache.hadoop.yarn.webapp.hamlet.TestHamlet
Tests run: 6, Failures: 0, Errors: 0, Skipped: 0, Time elapsed: 1.406 sec - in org.apache.hadoop.yarn.webapp.hamlet.TestHamlet
Java HotSpot(TM) 64-Bit Server VM warning: ignoring option MaxPermSize=768m; support was removed
in 8.0
Running org.apache.hadoop.yarn.webapp.TestParseRoute
Tests run: 10, Failures: 0, Errors: 0, Skipped: 0, Time elapsed: 0.509 sec - in org.apache.hadoop.yarn.webapp.TestParseRoute
Java HotSpot(TM) 64-Bit Server VM warning: ignoring option MaxPermSize=768m; support was removed
in 8.0
Running org.apache.hadoop.yarn.webapp.test.TestWebAppTests
Tests run: 4, Failures: 0, Errors: 0, Skipped: 0, Time elapsed: 1.645 sec - in org.apache.hadoop.yarn.webapp.test.TestWebAppTests
Java HotSpot(TM) 64-Bit Server VM warning: ignoring option MaxPermSize=768m; support was removed
in 8.0
Running org.apache.hadoop.yarn.webapp.TestSubViews
Tests run: 1, Failures: 0, Errors: 0, Skipped: 0, Time elapsed: 2.022 sec - in org.apache.hadoop.yarn.webapp.TestSubViews
Java HotSpot(TM) 64-Bit Server VM warning: ignoring option MaxPermSize=768m; support was removed
in 8.0
Running org.apache.hadoop.yarn.webapp.util.TestWebAppUtils
Tests run: 3, Failures: 0, Errors: 0, Skipped: 0, Time elapsed: 2.967 sec - in org.apache.hadoop.yarn.webapp.util.TestWebAppUtils
Java HotSpot(TM) 64-Bit Server VM warning: ignoring option MaxPermSize=768m; support was removed
in 8.0
Running org.apache.hadoop.yarn.webapp.view.TestInfoBlock
Tests run: 2, Failures: 0, Errors: 0, Skipped: 0, Time elapsed: 1.927 sec - in org.apache.hadoop.yarn.webapp.view.TestInfoBlock
Java HotSpot(TM) 64-Bit Server VM warning: ignoring option MaxPermSize=768m; support was removed
in 8.0
Running org.apache.hadoop.yarn.webapp.view.TestTwoColumnLayout
Tests run: 1, Failures: 0, Errors: 0, Skipped: 0, Time elapsed: 2.548 sec - in org.apache.hadoop.yarn.webapp.view.TestTwoColumnLayout
Java HotSpot(TM) 64-Bit Server VM warning: ignoring option MaxPermSize=768m; support was removed
in 8.0
Running org.apache.hadoop.yarn.webapp.view.TestCommonViews
Tests run: 5, Failures: 0, Errors: 0, Skipped: 0, Time elapsed: 2.247 sec - in org.apache.hadoop.yarn.webapp.view.TestCommonViews
Java HotSpot(TM) 64-Bit Server VM warning: ignoring option MaxPermSize=768m; support was removed
in 8.0
Running org.apache.hadoop.yarn.webapp.view.TestHtmlPage
Tests run: 2, Failures: 0, Errors: 0, Skipped: 0, Time elapsed: 2.266 sec - in org.apache.hadoop.yarn.webapp.view.TestHtmlPage
Java HotSpot(TM) 64-Bit Server VM warning: ignoring option MaxPermSize=768m; support was removed
in 8.0
Running org.apache.hadoop.yarn.webapp.view.TestHtmlBlock
Tests run: 3, Failures: 0, Errors: 0, Skipped: 0, Time elapsed: 1.972 sec - in org.apache.hadoop.yarn.webapp.view.TestHtmlBlock
Java HotSpot(TM) 64-Bit Server VM warning: ignoring option MaxPermSize=768m; support was removed
in 8.0
Running org.apache.hadoop.yarn.webapp.view.TestTwoColumnCssPage
Tests run: 1, Failures: 0, Errors: 0, Skipped: 0, Time elapsed: 2.412 sec - in org.apache.hadoop.yarn.webapp.view.TestTwoColumnCssPage
Java HotSpot(TM) 64-Bit Server VM warning: ignoring option MaxPermSize=768m; support was removed
in 8.0
Running org.apache.hadoop.yarn.webapp.TestWebApp
Tests run: 9, Failures: 0, Errors: 0, Skipped: 0, Time elapsed: 10.171 sec - in org.apache.hadoop.yarn.webapp.TestWebApp
Java HotSpot(TM) 64-Bit Server VM warning: ignoring option MaxPermSize=768m; support was removed
in 8.0
Running org.apache.hadoop.yarn.TestRPCFactories
Tests run: 1, Failures: 0, Errors: 0, Skipped: 0, Time elapsed: 1.925 sec - in org.apache.hadoop.yarn.TestRPCFactories

Results :

Failed tests: 
  TestAggregatedLogDeletionService.testRefreshLogRetentionSettings:300 
Argument(s) are different! Wanted:
fileSystem.delete(
    mockfs://foo/tmp/logs/me/logs/application_1455774365290_0002,
    true
);
-> at org.apache.hadoop.yarn.logaggregation.TestAggregatedLogDeletionService.testRefreshLogRetentionSettings(TestAggregatedLogDeletionService.java:300)
Actual invocation has different arguments:
fileSystem.delete(
    mockfs://foo/tmp/logs/me/logs/application_1455774365150_0001,
    true
);
-> at org.apache.hadoop.fs.FilterFileSystem.delete(FilterFileSystem.java:245)


Tests run: 338, Failures: 1, Errors: 0, Skipped: 7

[INFO] ------------------------------------------------------------------------
[INFO] Reactor Summary:
[INFO] 
[INFO] Apache Hadoop YARN ................................ SUCCESS [ 12.072 s]
[INFO] Apache Hadoop YARN API ............................ SUCCESS [03:22 min]
[INFO] Apache Hadoop YARN Common ......................... FAILURE [03:41 min]
[INFO] Apache Hadoop YARN Server ......................... SKIPPED
[INFO] Apache Hadoop YARN Server Common .................. SKIPPED
[INFO] Apache Hadoop YARN NodeManager .................... SKIPPED
[INFO] Apache Hadoop YARN Web Proxy ...................... SKIPPED
[INFO] Apache Hadoop YARN ApplicationHistoryService ...... SKIPPED
[INFO] Apache Hadoop YARN ResourceManager ................ SKIPPED
[INFO] Apache Hadoop YARN Server Tests ................... SKIPPED
[INFO] Apache Hadoop YARN Client ......................... SKIPPED
[INFO] Apache Hadoop YARN SharedCacheManager ............. SKIPPED
[INFO] Apache Hadoop YARN Timeline Plugin Storage ........ SKIPPED
[INFO] Apache Hadoop YARN Applications ................... SKIPPED
[INFO] Apache Hadoop YARN DistributedShell ............... SKIPPED
[INFO] Apache Hadoop YARN Unmanaged Am Launcher .......... SKIPPED
[INFO] Apache Hadoop YARN Site ........................... SKIPPED
[INFO] Apache Hadoop YARN Registry ....................... SKIPPED
[INFO] Apache Hadoop YARN Project ........................ SKIPPED
[INFO] ------------------------------------------------------------------------
[INFO] BUILD FAILURE
[INFO] ------------------------------------------------------------------------
[INFO] Total time: 07:20 min
[INFO] Finished at: 2016-02-18T05:48:36+00:00
[INFO] Final Memory: 80M/1096M
[INFO] ------------------------------------------------------------------------
[ERROR] Failed to execute goal org.apache.maven.plugins:maven-surefire-plugin:2.17:test (default-test)
on project hadoop-yarn-common: There are test failures.
[ERROR] 
[ERROR] Please refer to <https://builds.apache.org/job/Hadoop-Yarn-trunk-Java8/ws/hadoop-yarn-project/hadoop-yarn/hadoop-yarn-common/target/surefire-reports>
for the individual test results.
[ERROR] -> [Help 1]
[ERROR] 
[ERROR] To see the full stack trace of the errors, re-run Maven with the -e switch.
[ERROR] Re-run Maven using the -X switch to enable full debug logging.
[ERROR] 
[ERROR] For more information about the errors and possible solutions, please read the following
articles:
[ERROR] [Help 1] http://cwiki.apache.org/confluence/display/MAVEN/MojoFailureException
[ERROR] 
[ERROR] After correcting the problems, you can resume the build with the command
[ERROR]   mvn <goals> -rf :hadoop-yarn-common
Build step 'Execute shell' marked build as failure
Archiving artifacts
Recording test results

Mime
View raw message