hadoop-yarn-dev mailing list archives

Site index · List index
Message view « Date » · « Thread »
Top « Date » · « Thread »
From Apache Jenkins Server <jenk...@builds.apache.org>
Subject Hadoop-Yarn-trunk - Build # 1799 - Failure
Date Mon, 22 Feb 2016 10:53:22 GMT
See https://builds.apache.org/job/Hadoop-Yarn-trunk/1799/

###################################################################################
########################## LAST 60 LINES OF THE CONSOLE ###########################
[...truncated 11244 lines...]
Tests run: 1, Failures: 0, Errors: 0, Skipped: 0, Time elapsed: 37.251 sec - in org.apache.hadoop.yarn.applications.distributedshell.TestDistributedShellWithNodeLabels
Running org.apache.hadoop.yarn.applications.distributedshell.TestDSAppMaster
Tests run: 2, Failures: 0, Errors: 0, Skipped: 0, Time elapsed: 2.493 sec - in org.apache.hadoop.yarn.applications.distributedshell.TestDSAppMaster

Results :

Tests in error: 
  TestDistributedShell.testDSRestartWithPreviousRunningContainers:366 ยป  test ti...

Tests run: 14, Failures: 0, Errors: 1, Skipped: 0

[INFO] ------------------------------------------------------------------------
[INFO] Reactor Summary:
[INFO] 
[INFO] Apache Hadoop YARN ................................ SUCCESS [  3.633 s]
[INFO] Apache Hadoop YARN API ............................ SUCCESS [04:51 min]
[INFO] Apache Hadoop YARN Common ......................... SUCCESS [03:16 min]
[INFO] Apache Hadoop YARN Server ......................... SUCCESS [  0.132 s]
[INFO] Apache Hadoop YARN Server Common .................. SUCCESS [ 49.958 s]
[INFO] Apache Hadoop YARN NodeManager .................... SUCCESS [10:19 min]
[INFO] Apache Hadoop YARN Web Proxy ...................... SUCCESS [ 28.993 s]
[INFO] Apache Hadoop YARN ApplicationHistoryService ...... SUCCESS [03:41 min]
[INFO] Apache Hadoop YARN ResourceManager ................ SUCCESS [  01:10 h]
[INFO] Apache Hadoop YARN Server Tests ................... SUCCESS [02:41 min]
[INFO] Apache Hadoop YARN Client ......................... SUCCESS [08:16 min]
[INFO] Apache Hadoop YARN SharedCacheManager ............. SUCCESS [ 27.984 s]
[INFO] Apache Hadoop YARN Timeline Plugin Storage ........ SUCCESS [ 52.969 s]
[INFO] Apache Hadoop YARN Applications ................... SUCCESS [  0.073 s]
[INFO] Apache Hadoop YARN DistributedShell ............... FAILURE [07:54 min]
[INFO] Apache Hadoop YARN Unmanaged Am Launcher .......... SKIPPED
[INFO] Apache Hadoop YARN Site ........................... SKIPPED
[INFO] Apache Hadoop YARN Registry ....................... SKIPPED
[INFO] Apache Hadoop YARN Project ........................ SKIPPED
[INFO] ------------------------------------------------------------------------
[INFO] BUILD FAILURE
[INFO] ------------------------------------------------------------------------
[INFO] Total time: 01:53 h
[INFO] Finished at: 2016-02-22T10:53:15+00:00
[INFO] Final Memory: 82M/602M
[INFO] ------------------------------------------------------------------------
[ERROR] Failed to execute goal org.apache.maven.plugins:maven-surefire-plugin:2.17:test (default-test)
on project hadoop-yarn-applications-distributedshell: There are test failures.
[ERROR] 
[ERROR] Please refer to /home/jenkins/jenkins-slave/workspace/Hadoop-Yarn-trunk/hadoop-yarn-project/hadoop-yarn/hadoop-yarn-applications/hadoop-yarn-applications-distributedshell/target/surefire-reports
for the individual test results.
[ERROR] -> [Help 1]
[ERROR] 
[ERROR] To see the full stack trace of the errors, re-run Maven with the -e switch.
[ERROR] Re-run Maven using the -X switch to enable full debug logging.
[ERROR] 
[ERROR] For more information about the errors and possible solutions, please read the following
articles:
[ERROR] [Help 1] http://cwiki.apache.org/confluence/display/MAVEN/MojoFailureException
[ERROR] 
[ERROR] After correcting the problems, you can resume the build with the command
[ERROR]   mvn <goals> -rf :hadoop-yarn-applications-distributedshell
Build step 'Execute shell' marked build as failure
Archiving artifacts
Recording test results
Sending e-mails to: yarn-dev@hadoop.apache.org
Email was triggered for: Failure - Any
Sending email for trigger: Failure - Any



###################################################################################
############################## FAILED TESTS (if any) ##############################
1 tests failed.
FAILED:  org.apache.hadoop.yarn.applications.distributedshell.TestDistributedShell.testDSRestartWithPreviousRunningContainers

Error Message:
test timed out after 90000 milliseconds

Stack Trace:
java.lang.Exception: test timed out after 90000 milliseconds
	at java.lang.Thread.sleep(Native Method)
	at org.apache.hadoop.yarn.applications.distributedshell.Client.monitorApplication(Client.java:735)
	at org.apache.hadoop.yarn.applications.distributedshell.Client.run(Client.java:716)
	at org.apache.hadoop.yarn.applications.distributedshell.TestDistributedShell.testDSRestartWithPreviousRunningContainers(TestDistributedShell.java:366)



Mime
  • Unnamed multipart/mixed (inline, None, 0 bytes)
View raw message