hadoop-yarn-dev mailing list archives

Site index · List index
Message view « Date » · « Thread »
Top « Date » · « Thread »
From Apache Jenkins Server <jenk...@builds.apache.org>
Subject Hadoop-Yarn-trunk-Java8 - Build # 1038 - Still Failing
Date Wed, 10 Feb 2016 17:54:11 GMT
See https://builds.apache.org/job/Hadoop-Yarn-trunk-Java8/1038/

###################################################################################
########################## LAST 60 LINES OF THE CONSOLE ###########################
[...truncated 4591 lines...]
Java HotSpot(TM) 64-Bit Server VM warning: ignoring option MaxPermSize=768m; support was removed
in 8.0
Running org.apache.hadoop.yarn.server.webproxy.TestWebAppProxyServer
Tests run: 2, Failures: 0, Errors: 0, Skipped: 0, Time elapsed: 1.676 sec - in org.apache.hadoop.yarn.server.webproxy.TestWebAppProxyServer

Results :

Tests in error: 
  TestWebAppProxyServlet.testAppReportForEmptyTrackingUrl:252 ยป  test timed out ...

Tests run: 20, Failures: 0, Errors: 1, Skipped: 0

[INFO] ------------------------------------------------------------------------
[INFO] Reactor Summary:
[INFO] 
[INFO] Apache Hadoop YARN ................................ SUCCESS [  3.829 s]
[INFO] Apache Hadoop YARN API ............................ SUCCESS [01:36 min]
[INFO] Apache Hadoop YARN Common ......................... SUCCESS [02:42 min]
[INFO] Apache Hadoop YARN Server ......................... SUCCESS [  0.085 s]
[INFO] Apache Hadoop YARN Server Common .................. SUCCESS [ 37.991 s]
[INFO] Apache Hadoop YARN NodeManager .................... SUCCESS [10:25 min]
[INFO] Apache Hadoop YARN Web Proxy ...................... FAILURE [ 12.989 s]
[INFO] Apache Hadoop YARN ApplicationHistoryService ...... SKIPPED
[INFO] Apache Hadoop YARN ResourceManager ................ SKIPPED
[INFO] Apache Hadoop YARN Server Tests ................... SKIPPED
[INFO] Apache Hadoop YARN Client ......................... SKIPPED
[INFO] Apache Hadoop YARN SharedCacheManager ............. SKIPPED
[INFO] Apache Hadoop YARN Timeline Plugin Storage ........ SKIPPED
[INFO] Apache Hadoop YARN Applications ................... SKIPPED
[INFO] Apache Hadoop YARN DistributedShell ............... SKIPPED
[INFO] Apache Hadoop YARN Unmanaged Am Launcher .......... SKIPPED
[INFO] Apache Hadoop YARN Site ........................... SKIPPED
[INFO] Apache Hadoop YARN Registry ....................... SKIPPED
[INFO] Apache Hadoop YARN Project ........................ SKIPPED
[INFO] ------------------------------------------------------------------------
[INFO] BUILD FAILURE
[INFO] ------------------------------------------------------------------------
[INFO] Total time: 15:41 min
[INFO] Finished at: 2016-02-10T17:54:12+00:00
[INFO] Final Memory: 93M/1131M
[INFO] ------------------------------------------------------------------------
[ERROR] Failed to execute goal org.apache.maven.plugins:maven-surefire-plugin:2.17:test (default-test)
on project hadoop-yarn-server-web-proxy: There are test failures.
[ERROR] 
[ERROR] Please refer to /home/jenkins/jenkins-slave/workspace/Hadoop-Yarn-trunk-Java8/hadoop-yarn-project/hadoop-yarn/hadoop-yarn-server/hadoop-yarn-server-web-proxy/target/surefire-reports
for the individual test results.
[ERROR] -> [Help 1]
[ERROR] 
[ERROR] To see the full stack trace of the errors, re-run Maven with the -e switch.
[ERROR] Re-run Maven using the -X switch to enable full debug logging.
[ERROR] 
[ERROR] For more information about the errors and possible solutions, please read the following
articles:
[ERROR] [Help 1] http://cwiki.apache.org/confluence/display/MAVEN/MojoFailureException
[ERROR] 
[ERROR] After correcting the problems, you can resume the build with the command
[ERROR]   mvn <goals> -rf :hadoop-yarn-server-web-proxy
Build step 'Execute shell' marked build as failure
Archiving artifacts
Recording test results
Sending e-mails to: yarn-dev@hadoop.apache.org
Email was triggered for: Failure - Any
Sending email for trigger: Failure - Any



###################################################################################
############################## FAILED TESTS (if any) ##############################
1 tests failed.
FAILED:  org.apache.hadoop.yarn.server.webproxy.TestWebAppProxyServlet.testAppReportForEmptyTrackingUrl

Error Message:
test timed out after 5000 milliseconds

Stack Trace:
java.lang.Exception: test timed out after 5000 milliseconds
	at java.net.SocketInputStream.socketRead0(Native Method)
	at java.net.SocketInputStream.read(SocketInputStream.java:150)
	at java.net.SocketInputStream.read(SocketInputStream.java:121)
	at java.io.BufferedInputStream.fill(BufferedInputStream.java:246)
	at java.io.BufferedInputStream.read1(BufferedInputStream.java:286)
	at java.io.BufferedInputStream.read(BufferedInputStream.java:345)
	at sun.net.www.http.HttpClient.parseHTTPHeader(HttpClient.java:701)
	at sun.net.www.http.HttpClient.parseHTTP(HttpClient.java:647)
	at sun.net.www.protocol.http.HttpURLConnection.getInputStream0(HttpURLConnection.java:1534)
	at sun.net.www.protocol.http.HttpURLConnection.getInputStream(HttpURLConnection.java:1439)
	at java.net.HttpURLConnection.getResponseCode(HttpURLConnection.java:480)
	at org.apache.hadoop.yarn.server.webproxy.TestWebAppProxyServlet.testAppReportForEmptyTrackingUrl(TestWebAppProxyServlet.java:252)



Mime
  • Unnamed multipart/mixed (inline, None, 0 bytes)
View raw message