hadoop-yarn-dev mailing list archives

Site index · List index
Message view « Date » · « Thread »
Top « Date » · « Thread »
From Apache Jenkins Server <jenk...@builds.apache.org>
Subject Hadoop-Yarn-trunk - Build # 1802 - Failure
Date Tue, 23 Feb 2016 00:19:58 GMT
See https://builds.apache.org/job/Hadoop-Yarn-trunk/1802/

###################################################################################
########################## LAST 60 LINES OF THE CONSOLE ###########################
[...truncated 10561 lines...]
Tests run: 3, Failures: 0, Errors: 0, Skipped: 0, Time elapsed: 20.327 sec - in org.apache.hadoop.yarn.server.TestDiskFailures
Running org.apache.hadoop.yarn.server.TestMiniYarnCluster
Tests run: 2, Failures: 0, Errors: 0, Skipped: 0, Time elapsed: 14.179 sec - in org.apache.hadoop.yarn.server.TestMiniYarnCluster

Results :

Tests in error: 
  TestMiniYarnClusterNodeUtilization.testMockNodeStatusHeartbeat:145->verifySimulatedUtilization:217
NullPointer

Tests run: 11, Failures: 0, Errors: 1, Skipped: 0

[INFO] ------------------------------------------------------------------------
[INFO] Reactor Summary:
[INFO] 
[INFO] Apache Hadoop YARN ................................ SUCCESS [  3.496 s]
[INFO] Apache Hadoop YARN API ............................ SUCCESS [04:18 min]
[INFO] Apache Hadoop YARN Common ......................... SUCCESS [02:59 min]
[INFO] Apache Hadoop YARN Server ......................... SUCCESS [  0.093 s]
[INFO] Apache Hadoop YARN Server Common .................. SUCCESS [ 45.167 s]
[INFO] Apache Hadoop YARN NodeManager .................... SUCCESS [09:38 min]
[INFO] Apache Hadoop YARN Web Proxy ...................... SUCCESS [ 25.787 s]
[INFO] Apache Hadoop YARN ApplicationHistoryService ...... SUCCESS [04:11 min]
[INFO] Apache Hadoop YARN ResourceManager ................ SUCCESS [  01:16 h]
[INFO] Apache Hadoop YARN Server Tests ................... FAILURE [02:36 min]
[INFO] Apache Hadoop YARN Client ......................... SKIPPED
[INFO] Apache Hadoop YARN SharedCacheManager ............. SKIPPED
[INFO] Apache Hadoop YARN Timeline Plugin Storage ........ SKIPPED
[INFO] Apache Hadoop YARN Applications ................... SKIPPED
[INFO] Apache Hadoop YARN DistributedShell ............... SKIPPED
[INFO] Apache Hadoop YARN Unmanaged Am Launcher .......... SKIPPED
[INFO] Apache Hadoop YARN Site ........................... SKIPPED
[INFO] Apache Hadoop YARN Registry ....................... SKIPPED
[INFO] Apache Hadoop YARN Project ........................ SKIPPED
[INFO] ------------------------------------------------------------------------
[INFO] BUILD FAILURE
[INFO] ------------------------------------------------------------------------
[INFO] Total time: 01:41 h
[INFO] Finished at: 2016-02-23T00:19:52+00:00
[INFO] Final Memory: 70M/666M
[INFO] ------------------------------------------------------------------------
[ERROR] Failed to execute goal org.apache.maven.plugins:maven-surefire-plugin:2.17:test (default-test)
on project hadoop-yarn-server-tests: There are test failures.
[ERROR] 
[ERROR] Please refer to /home/jenkins/jenkins-slave/workspace/Hadoop-Yarn-trunk/hadoop-yarn-project/hadoop-yarn/hadoop-yarn-server/hadoop-yarn-server-tests/target/surefire-reports
for the individual test results.
[ERROR] -> [Help 1]
[ERROR] 
[ERROR] To see the full stack trace of the errors, re-run Maven with the -e switch.
[ERROR] Re-run Maven using the -X switch to enable full debug logging.
[ERROR] 
[ERROR] For more information about the errors and possible solutions, please read the following
articles:
[ERROR] [Help 1] http://cwiki.apache.org/confluence/display/MAVEN/MojoFailureException
[ERROR] 
[ERROR] After correcting the problems, you can resume the build with the command
[ERROR]   mvn <goals> -rf :hadoop-yarn-server-tests
Build step 'Execute shell' marked build as failure
Archiving artifacts
Recording test results
Sending e-mails to: yarn-dev@hadoop.apache.org
Email was triggered for: Failure - Any
Sending email for trigger: Failure - Any



###################################################################################
############################## FAILED TESTS (if any) ##############################
1 tests failed.
FAILED:  org.apache.hadoop.yarn.server.TestMiniYarnClusterNodeUtilization.testMockNodeStatusHeartbeat

Error Message:
null

Stack Trace:
java.lang.NullPointerException: null
	at org.apache.hadoop.yarn.server.TestMiniYarnClusterNodeUtilization.verifySimulatedUtilization(TestMiniYarnClusterNodeUtilization.java:217)
	at org.apache.hadoop.yarn.server.TestMiniYarnClusterNodeUtilization.testMockNodeStatusHeartbeat(TestMiniYarnClusterNodeUtilization.java:145)



Mime
  • Unnamed multipart/mixed (inline, None, 0 bytes)
View raw message