hadoop-yarn-dev mailing list archives

Site index · List index
Message view « Date » · « Thread »
Top « Date » · « Thread »
From Apache Jenkins Server <jenk...@builds.apache.org>
Subject Build failed in Jenkins: Hadoop-Yarn-trunk-Java8 #1012
Date Thu, 04 Feb 2016 01:03:47 GMT
See <https://builds.apache.org/job/Hadoop-Yarn-trunk-Java8/1012/changes>

Changes:

[shv] Move HDFS-9601 to branch-2.8.0 in CHANGES.txt. (shv)

[zhezhang] HDFS-9658. Erasure Coding: allow to use multiple EC policies in striping

[shv] HDFS-9503. Use generic option -fs for NNThroughputBenchmark instead of

[zhezhang] HADOOP-12041. Implement another Reed-Solomon coder in pure Java.

------------------------------------------
[...truncated 5285 lines...]
[INFO] 
[INFO] --- maven-resources-plugin:2.6:resources (default-resources) @ hadoop-yarn-server-tests
---
[INFO] Using 'UTF-8' encoding to copy filtered resources.
[INFO] skip non existing resourceDirectory <https://builds.apache.org/job/Hadoop-Yarn-trunk-Java8/ws/hadoop-yarn-project/hadoop-yarn/hadoop-yarn-server/hadoop-yarn-server-tests/src/main/resources>
[INFO] 
[INFO] --- maven-compiler-plugin:3.1:compile (default-compile) @ hadoop-yarn-server-tests
---
[INFO] Compiling 1 source file to <https://builds.apache.org/job/Hadoop-Yarn-trunk-Java8/ws/hadoop-yarn-project/hadoop-yarn/hadoop-yarn-server/hadoop-yarn-server-tests/target/classes>
[INFO] 
[INFO] --- maven-resources-plugin:2.6:testResources (default-testResources) @ hadoop-yarn-server-tests
---
[INFO] Using 'UTF-8' encoding to copy filtered resources.
[INFO] Copying 4 resources
[INFO] 
[INFO] --- maven-compiler-plugin:3.1:testCompile (default-testCompile) @ hadoop-yarn-server-tests
---
[INFO] Compiling 9 source files to <https://builds.apache.org/job/Hadoop-Yarn-trunk-Java8/ws/hadoop-yarn-project/hadoop-yarn/hadoop-yarn-server/hadoop-yarn-server-tests/target/test-classes>
[WARNING] <https://builds.apache.org/job/Hadoop-Yarn-trunk-Java8/ws/hadoop-yarn-project/hadoop-yarn/hadoop-yarn-server/hadoop-yarn-server-tests/src/test/java/org/apache/hadoop/yarn/server/TestMiniYarnCluster.java>:
<https://builds.apache.org/job/Hadoop-Yarn-trunk-Java8/ws/hadoop-yarn-project/hadoop-yarn/hadoop-yarn-server/hadoop-yarn-server-tests/src/test/java/org/apache/hadoop/yarn/server/TestMiniYarnCluster.java>
uses or overrides a deprecated API.
[WARNING] <https://builds.apache.org/job/Hadoop-Yarn-trunk-Java8/ws/hadoop-yarn-project/hadoop-yarn/hadoop-yarn-server/hadoop-yarn-server-tests/src/test/java/org/apache/hadoop/yarn/server/TestMiniYarnCluster.java>:
Recompile with -Xlint:deprecation for details.
[INFO] 
[INFO] --- maven-jar-plugin:2.5:test-jar (default) @ hadoop-yarn-server-tests ---
[INFO] Building jar: <https://builds.apache.org/job/Hadoop-Yarn-trunk-Java8/ws/hadoop-yarn-project/hadoop-yarn/hadoop-yarn-server/hadoop-yarn-server-tests/target/hadoop-yarn-server-tests-3.0.0-SNAPSHOT-tests.jar>
[INFO] 
[INFO] --- maven-surefire-plugin:2.17:test (default-test) @ hadoop-yarn-server-tests ---
[INFO] Surefire report directory: <https://builds.apache.org/job/Hadoop-Yarn-trunk-Java8/ws/hadoop-yarn-project/hadoop-yarn/hadoop-yarn-server/hadoop-yarn-server-tests/target/surefire-reports>

-------------------------------------------------------
 T E S T S
-------------------------------------------------------

-------------------------------------------------------
 T E S T S
-------------------------------------------------------
Java HotSpot(TM) 64-Bit Server VM warning: ignoring option MaxPermSize=768m; support was removed
in 8.0
Running org.apache.hadoop.yarn.server.TestContainerManagerSecurity
Tests run: 2, Failures: 0, Errors: 0, Skipped: 0, Time elapsed: 51.562 sec - in org.apache.hadoop.yarn.server.TestContainerManagerSecurity
Java HotSpot(TM) 64-Bit Server VM warning: ignoring option MaxPermSize=768m; support was removed
in 8.0
Running org.apache.hadoop.yarn.server.TestMiniYarnClusterNodeUtilization
Tests run: 2, Failures: 0, Errors: 0, Skipped: 0, Time elapsed: 47.809 sec - in org.apache.hadoop.yarn.server.TestMiniYarnClusterNodeUtilization
Java HotSpot(TM) 64-Bit Server VM warning: ignoring option MaxPermSize=768m; support was removed
in 8.0
Running org.apache.hadoop.yarn.server.TestMiniYARNClusterForHA
Tests run: 1, Failures: 0, Errors: 0, Skipped: 0, Time elapsed: 6.193 sec - in org.apache.hadoop.yarn.server.TestMiniYARNClusterForHA
Java HotSpot(TM) 64-Bit Server VM warning: ignoring option MaxPermSize=768m; support was removed
in 8.0
Running org.apache.hadoop.yarn.server.TestMiniYarnCluster
Tests run: 2, Failures: 0, Errors: 0, Skipped: 0, Time elapsed: 13.906 sec - in org.apache.hadoop.yarn.server.TestMiniYarnCluster
Java HotSpot(TM) 64-Bit Server VM warning: ignoring option MaxPermSize=768m; support was removed
in 8.0
Running org.apache.hadoop.yarn.server.TestRMNMSecretKeys
Tests run: 1, Failures: 0, Errors: 0, Skipped: 0, Time elapsed: 2.061 sec - in org.apache.hadoop.yarn.server.TestRMNMSecretKeys
Java HotSpot(TM) 64-Bit Server VM warning: ignoring option MaxPermSize=768m; support was removed
in 8.0
Running org.apache.hadoop.yarn.server.TestDiskFailures
Tests run: 3, Failures: 0, Errors: 0, Skipped: 0, Time elapsed: 18.713 sec - in org.apache.hadoop.yarn.server.TestDiskFailures

Results :

Tests run: 11, Failures: 0, Errors: 0, Skipped: 0

[INFO] 
[INFO] --- maven-jar-plugin:2.5:jar (default-jar) @ hadoop-yarn-server-tests ---
[INFO] Building jar: <https://builds.apache.org/job/Hadoop-Yarn-trunk-Java8/ws/hadoop-yarn-project/hadoop-yarn/hadoop-yarn-server/hadoop-yarn-server-tests/target/hadoop-yarn-server-tests-3.0.0-SNAPSHOT.jar>
[INFO] 
[INFO] --- maven-source-plugin:2.3:jar-no-fork (hadoop-java-sources) @ hadoop-yarn-server-tests
---
[INFO] Building jar: <https://builds.apache.org/job/Hadoop-Yarn-trunk-Java8/ws/hadoop-yarn-project/hadoop-yarn/hadoop-yarn-server/hadoop-yarn-server-tests/target/hadoop-yarn-server-tests-3.0.0-SNAPSHOT-sources.jar>
[INFO] 
[INFO] --- maven-source-plugin:2.3:test-jar-no-fork (hadoop-java-sources) @ hadoop-yarn-server-tests
---
[INFO] Building jar: <https://builds.apache.org/job/Hadoop-Yarn-trunk-Java8/ws/hadoop-yarn-project/hadoop-yarn/hadoop-yarn-server/hadoop-yarn-server-tests/target/hadoop-yarn-server-tests-3.0.0-SNAPSHOT-test-sources.jar>
[INFO] 
[INFO] --- maven-enforcer-plugin:1.3.1:enforce (dist-enforce) @ hadoop-yarn-server-tests ---
[INFO] 
[INFO] --- maven-site-plugin:3.4:attach-descriptor (attach-descriptor) @ hadoop-yarn-server-tests
---
[INFO] 
[INFO] --- maven-javadoc-plugin:2.8.1:jar (module-javadocs) @ hadoop-yarn-server-tests ---
[INFO] Skipping javadoc generation
[INFO] 
[INFO] --- maven-enforcer-plugin:1.3.1:enforce (depcheck) @ hadoop-yarn-server-tests ---
[INFO] 
[INFO] --- maven-checkstyle-plugin:2.15:checkstyle (default-cli) @ hadoop-yarn-server-tests
---
[INFO] There are 767 errors reported by Checkstyle 6.6 with checkstyle/checkstyle.xml ruleset.
[WARNING] Unable to locate Source XRef to link to - DISABLED
[INFO] 
[INFO] --- findbugs-maven-plugin:3.0.0:findbugs (default-cli) @ hadoop-yarn-server-tests ---
[INFO] Fork Value is true
[INFO] Done FindBugs Analysis....
[INFO]                                                                         
[INFO] ------------------------------------------------------------------------
[INFO] Building Apache Hadoop YARN Client 3.0.0-SNAPSHOT
[INFO] ------------------------------------------------------------------------
[INFO] 
[INFO] --- maven-clean-plugin:2.5:clean (default-clean) @ hadoop-yarn-client ---
[INFO] Deleting <https://builds.apache.org/job/Hadoop-Yarn-trunk-Java8/ws/hadoop-yarn-project/hadoop-yarn/hadoop-yarn-client/target>
[INFO] 
[INFO] --- maven-antrun-plugin:1.7:run (create-testdirs) @ hadoop-yarn-client ---
[INFO] Executing tasks

main:
    [mkdir] Created dir: <https://builds.apache.org/job/Hadoop-Yarn-trunk-Java8/ws/hadoop-yarn-project/hadoop-yarn/hadoop-yarn-client/target/test-dir>
[INFO] Executed tasks
[INFO] 
[INFO] --- hadoop-maven-plugins:3.0.0-SNAPSHOT:protoc (compile-protoc) @ hadoop-yarn-client
---
[INFO] Wrote protoc checksums to file <https://builds.apache.org/job/Hadoop-Yarn-trunk-Java8/ws/hadoop-yarn-project/hadoop-yarn/hadoop-yarn-client/target/hadoop-maven-plugins-protoc-checksums.json>
[INFO] 
[INFO] --- maven-resources-plugin:2.6:resources (default-resources) @ hadoop-yarn-client ---
[INFO] Using 'UTF-8' encoding to copy filtered resources.
[INFO] skip non existing resourceDirectory <https://builds.apache.org/job/Hadoop-Yarn-trunk-Java8/ws/hadoop-yarn-project/hadoop-yarn/hadoop-yarn-client/src/main/resources>
[INFO] 
[INFO] --- maven-compiler-plugin:3.1:compile (default-compile) @ hadoop-yarn-client ---
[INFO] Compiling 33 source files to <https://builds.apache.org/job/Hadoop-Yarn-trunk-Java8/ws/hadoop-yarn-project/hadoop-yarn/hadoop-yarn-client/target/classes>
[INFO] 
[INFO] --- maven-resources-plugin:2.6:testResources (default-testResources) @ hadoop-yarn-client
---
[INFO] Using 'UTF-8' encoding to copy filtered resources.
[INFO] Copying 6 resources
[INFO] 
[INFO] --- maven-compiler-plugin:3.1:testCompile (default-testCompile) @ hadoop-yarn-client
---
[INFO] Compiling 24 source files to <https://builds.apache.org/job/Hadoop-Yarn-trunk-Java8/ws/hadoop-yarn-project/hadoop-yarn/hadoop-yarn-client/target/test-classes>
[WARNING] <https://builds.apache.org/job/Hadoop-Yarn-trunk-Java8/ws/hadoop-yarn-project/hadoop-yarn/hadoop-yarn-client/src/test/java/org/apache/hadoop/yarn/client/ProtocolHATestBase.java>:
<https://builds.apache.org/job/Hadoop-Yarn-trunk-Java8/ws/hadoop-yarn-project/hadoop-yarn/hadoop-yarn-client/src/test/java/org/apache/hadoop/yarn/client/ProtocolHATestBase.java>
uses or overrides a deprecated API.
[WARNING] <https://builds.apache.org/job/Hadoop-Yarn-trunk-Java8/ws/hadoop-yarn-project/hadoop-yarn/hadoop-yarn-client/src/test/java/org/apache/hadoop/yarn/client/ProtocolHATestBase.java>:
Recompile with -Xlint:deprecation for details.
[INFO] 
[INFO] --- maven-surefire-plugin:2.17:test (default-test) @ hadoop-yarn-client ---
[INFO] Surefire report directory: <https://builds.apache.org/job/Hadoop-Yarn-trunk-Java8/ws/hadoop-yarn-project/hadoop-yarn/hadoop-yarn-client/target/surefire-reports>

-------------------------------------------------------
 T E S T S
-------------------------------------------------------

-------------------------------------------------------
 T E S T S
-------------------------------------------------------
Java HotSpot(TM) 64-Bit Server VM warning: ignoring option MaxPermSize=768m; support was removed
in 8.0
Running org.apache.hadoop.yarn.client.TestApplicationMasterServiceProtocolOnHA
Tests run: 3, Failures: 0, Errors: 0, Skipped: 0, Time elapsed: 18.913 sec - in org.apache.hadoop.yarn.client.TestApplicationMasterServiceProtocolOnHA
Java HotSpot(TM) 64-Bit Server VM warning: ignoring option MaxPermSize=768m; support was removed
in 8.0
Running org.apache.hadoop.yarn.client.TestHedgingRequestRMFailoverProxyProvider
Tests run: 1, Failures: 0, Errors: 1, Skipped: 0, Time elapsed: 8.119 sec <<< FAILURE!
- in org.apache.hadoop.yarn.client.TestHedgingRequestRMFailoverProxyProvider
testHedgingRequestProxyProvider(org.apache.hadoop.yarn.client.TestHedgingRequestRMFailoverProxyProvider)
 Time elapsed: 8.031 sec  <<< ERROR!
org.apache.hadoop.yarn.exceptions.YarnRuntimeException: java.io.IOException: ResourceManager
failed to start. Final state is STOPPED
	at org.apache.hadoop.yarn.server.MiniYARNCluster.startResourceManager(MiniYARNCluster.java:334)
	at org.apache.hadoop.yarn.server.MiniYARNCluster.access$400(MiniYARNCluster.java:100)
	at org.apache.hadoop.yarn.server.MiniYARNCluster$ResourceManagerWrapper.serviceStart(MiniYARNCluster.java:458)
	at org.apache.hadoop.service.AbstractService.start(AbstractService.java:193)
	at org.apache.hadoop.service.CompositeService.serviceStart(CompositeService.java:120)
	at org.apache.hadoop.service.AbstractService.start(AbstractService.java:193)
	at org.apache.hadoop.yarn.client.TestHedgingRequestRMFailoverProxyProvider.testHedgingRequestProxyProvider(TestHedgingRequestRMFailoverProxyProvider.java:57)

Java HotSpot(TM) 64-Bit Server VM warning: ignoring option MaxPermSize=768m; support was removed
in 8.0
Running org.apache.hadoop.yarn.client.TestRMFailover
Tests run: 5, Failures: 0, Errors: 0, Skipped: 0, Time elapsed: 41.764 sec - in org.apache.hadoop.yarn.client.TestRMFailover
Java HotSpot(TM) 64-Bit Server VM warning: ignoring option MaxPermSize=768m; support was removed
in 8.0
Running org.apache.hadoop.yarn.client.TestResourceTrackerOnHA
Tests run: 1, Failures: 0, Errors: 0, Skipped: 0, Time elapsed: 8.615 sec - in org.apache.hadoop.yarn.client.TestResourceTrackerOnHA
Java HotSpot(TM) 64-Bit Server VM warning: ignoring option MaxPermSize=768m; support was removed
in 8.0
Running org.apache.hadoop.yarn.client.TestGetGroups
Tests run: 6, Failures: 0, Errors: 0, Skipped: 0, Time elapsed: 4.961 sec - in org.apache.hadoop.yarn.client.TestGetGroups
Java HotSpot(TM) 64-Bit Server VM warning: ignoring option MaxPermSize=768m; support was removed
in 8.0
Running org.apache.hadoop.yarn.client.TestResourceManagerAdministrationProtocolPBClientImpl
Tests run: 7, Failures: 0, Errors: 0, Skipped: 0, Time elapsed: 5 sec - in org.apache.hadoop.yarn.client.TestResourceManagerAdministrationProtocolPBClientImpl
Java HotSpot(TM) 64-Bit Server VM warning: ignoring option MaxPermSize=768m; support was removed
in 8.0
Running org.apache.hadoop.yarn.client.api.async.impl.TestAMRMClientAsync
Tests run: 9, Failures: 0, Errors: 0, Skipped: 0, Time elapsed: 3.133 sec - in org.apache.hadoop.yarn.client.api.async.impl.TestAMRMClientAsync
Java HotSpot(TM) 64-Bit Server VM warning: ignoring option MaxPermSize=768m; support was removed
in 8.0
Running org.apache.hadoop.yarn.client.api.async.impl.TestNMClientAsync
Tests run: 2, Failures: 0, Errors: 0, Skipped: 0, Time elapsed: 1.021 sec - in org.apache.hadoop.yarn.client.api.async.impl.TestNMClientAsync
Java HotSpot(TM) 64-Bit Server VM warning: ignoring option MaxPermSize=768m; support was removed
in 8.0
Running org.apache.hadoop.yarn.client.api.impl.TestYarnClient
Tests run: 22, Failures: 0, Errors: 0, Skipped: 0, Time elapsed: 26.739 sec - in org.apache.hadoop.yarn.client.api.impl.TestYarnClient
Java HotSpot(TM) 64-Bit Server VM warning: ignoring option MaxPermSize=768m; support was removed
in 8.0
Running org.apache.hadoop.yarn.client.api.impl.TestAMRMClientOnRMRestart
Tests run: 3, Failures: 0, Errors: 0, Skipped: 0, Time elapsed: 29.495 sec - in org.apache.hadoop.yarn.client.api.impl.TestAMRMClientOnRMRestart
Java HotSpot(TM) 64-Bit Server VM warning: ignoring option MaxPermSize=768m; support was removed
in 8.0
Running org.apache.hadoop.yarn.client.api.impl.TestNMClient
Tests run: 2, Failures: 0, Errors: 0, Skipped: 0, Time elapsed: 77.788 sec - in org.apache.hadoop.yarn.client.api.impl.TestNMClient
Java HotSpot(TM) 64-Bit Server VM warning: ignoring option MaxPermSize=768m; support was removed
in 8.0
Running org.apache.hadoop.yarn.client.api.impl.TestAMRMClient
Tests run: 11, Failures: 0, Errors: 0, Skipped: 0, Time elapsed: 77.08 sec - in org.apache.hadoop.yarn.client.api.impl.TestAMRMClient
Java HotSpot(TM) 64-Bit Server VM warning: ignoring option MaxPermSize=768m; support was removed
in 8.0
Running org.apache.hadoop.yarn.client.api.impl.TestAMRMClientContainerRequest
Tests run: 5, Failures: 0, Errors: 0, Skipped: 0, Time elapsed: 0.907 sec - in org.apache.hadoop.yarn.client.api.impl.TestAMRMClientContainerRequest
Java HotSpot(TM) 64-Bit Server VM warning: ignoring option MaxPermSize=768m; support was removed
in 8.0
Running org.apache.hadoop.yarn.client.api.impl.TestAHSClient
Tests run: 7, Failures: 0, Errors: 0, Skipped: 0, Time elapsed: 1.215 sec - in org.apache.hadoop.yarn.client.api.impl.TestAHSClient
Java HotSpot(TM) 64-Bit Server VM warning: ignoring option MaxPermSize=768m; support was removed
in 8.0
Running org.apache.hadoop.yarn.client.api.impl.TestSharedCacheClientImpl
Tests run: 6, Failures: 0, Errors: 0, Skipped: 0, Time elapsed: 1.131 sec - in org.apache.hadoop.yarn.client.api.impl.TestSharedCacheClientImpl
Java HotSpot(TM) 64-Bit Server VM warning: ignoring option MaxPermSize=768m; support was removed
in 8.0
Running org.apache.hadoop.yarn.client.TestApplicationClientProtocolOnHA
Tests run: 17, Failures: 0, Errors: 0, Skipped: 0, Time elapsed: 123.251 sec - in org.apache.hadoop.yarn.client.TestApplicationClientProtocolOnHA
Java HotSpot(TM) 64-Bit Server VM warning: ignoring option MaxPermSize=768m; support was removed
in 8.0
Running org.apache.hadoop.yarn.client.TestYarnApiClasses
Tests run: 3, Failures: 0, Errors: 0, Skipped: 0, Time elapsed: 0.41 sec - in org.apache.hadoop.yarn.client.TestYarnApiClasses
Java HotSpot(TM) 64-Bit Server VM warning: ignoring option MaxPermSize=768m; support was removed
in 8.0
Running org.apache.hadoop.yarn.client.cli.TestRMAdminCLI
Tests run: 25, Failures: 0, Errors: 0, Skipped: 0, Time elapsed: 4.021 sec - in org.apache.hadoop.yarn.client.cli.TestRMAdminCLI
Java HotSpot(TM) 64-Bit Server VM warning: ignoring option MaxPermSize=768m; support was removed
in 8.0
Running org.apache.hadoop.yarn.client.cli.TestYarnCLI
Tests run: 33, Failures: 0, Errors: 0, Skipped: 0, Time elapsed: 11.331 sec - in org.apache.hadoop.yarn.client.cli.TestYarnCLI
Java HotSpot(TM) 64-Bit Server VM warning: ignoring option MaxPermSize=768m; support was removed
in 8.0
Running org.apache.hadoop.yarn.client.cli.TestClusterCLI
Tests run: 4, Failures: 0, Errors: 0, Skipped: 0, Time elapsed: 1.395 sec - in org.apache.hadoop.yarn.client.cli.TestClusterCLI
Java HotSpot(TM) 64-Bit Server VM warning: ignoring option MaxPermSize=768m; support was removed
in 8.0
Running org.apache.hadoop.yarn.client.cli.TestLogsCLI
Tests run: 6, Failures: 0, Errors: 0, Skipped: 0, Time elapsed: 1.441 sec - in org.apache.hadoop.yarn.client.cli.TestLogsCLI

Results :

Tests in error: 
  TestHedgingRequestRMFailoverProxyProvider.testHedgingRequestProxyProvider:57 ยป YarnRuntime

Tests run: 178, Failures: 0, Errors: 1, Skipped: 0

[INFO] ------------------------------------------------------------------------
[INFO] Reactor Summary:
[INFO] 
[INFO] Apache Hadoop YARN ................................ SUCCESS [  4.215 s]
[INFO] Apache Hadoop YARN API ............................ SUCCESS [01:41 min]
[INFO] Apache Hadoop YARN Common ......................... SUCCESS [02:44 min]
[INFO] Apache Hadoop YARN Server ......................... SUCCESS [  0.110 s]
[INFO] Apache Hadoop YARN Server Common .................. SUCCESS [ 42.110 s]
[INFO] Apache Hadoop YARN NodeManager .................... SUCCESS [10:15 min]
[INFO] Apache Hadoop YARN Web Proxy ...................... SUCCESS [ 19.791 s]
[INFO] Apache Hadoop YARN ApplicationHistoryService ...... SUCCESS [03:37 min]
[INFO] Apache Hadoop YARN ResourceManager ................ SUCCESS [  01:05 h]
[INFO] Apache Hadoop YARN Server Tests ................... SUCCESS [02:33 min]
[INFO] Apache Hadoop YARN Client ......................... FAILURE [08:16 min]
[INFO] Apache Hadoop YARN SharedCacheManager ............. SKIPPED
[INFO] Apache Hadoop YARN Timeline Plugin Storage ........ SKIPPED
[INFO] Apache Hadoop YARN Applications ................... SKIPPED
[INFO] Apache Hadoop YARN DistributedShell ............... SKIPPED
[INFO] Apache Hadoop YARN Unmanaged Am Launcher .......... SKIPPED
[INFO] Apache Hadoop YARN Site ........................... SKIPPED
[INFO] Apache Hadoop YARN Registry ....................... SKIPPED
[INFO] Apache Hadoop YARN Project ........................ SKIPPED
[INFO] ------------------------------------------------------------------------
[INFO] BUILD FAILURE
[INFO] ------------------------------------------------------------------------
[INFO] Total time: 01:36 h
[INFO] Finished at: 2016-02-04T01:03:45+00:00
[INFO] Final Memory: 80M/963M
[INFO] ------------------------------------------------------------------------
[ERROR] Failed to execute goal org.apache.maven.plugins:maven-surefire-plugin:2.17:test (default-test)
on project hadoop-yarn-client: There are test failures.
[ERROR] 
[ERROR] Please refer to <https://builds.apache.org/job/Hadoop-Yarn-trunk-Java8/ws/hadoop-yarn-project/hadoop-yarn/hadoop-yarn-client/target/surefire-reports>
for the individual test results.
[ERROR] -> [Help 1]
[ERROR] 
[ERROR] To see the full stack trace of the errors, re-run Maven with the -e switch.
[ERROR] Re-run Maven using the -X switch to enable full debug logging.
[ERROR] 
[ERROR] For more information about the errors and possible solutions, please read the following
articles:
[ERROR] [Help 1] http://cwiki.apache.org/confluence/display/MAVEN/MojoFailureException
[ERROR] 
[ERROR] After correcting the problems, you can resume the build with the command
[ERROR]   mvn <goals> -rf :hadoop-yarn-client
Build step 'Execute shell' marked build as failure
Archiving artifacts
Recording test results

Mime
View raw message