hadoop-yarn-dev mailing list archives

Site index · List index
Message view « Date » · « Thread »
Top « Date » · « Thread »
From Apache Jenkins Server <jenk...@builds.apache.org>
Subject Hadoop-Yarn-trunk-Java8 - Build # 1028 - Still Failing
Date Mon, 08 Feb 2016 20:11:01 GMT
See https://builds.apache.org/job/Hadoop-Yarn-trunk-Java8/1028/

###################################################################################
########################## LAST 60 LINES OF THE CONSOLE ###########################
[...truncated 5243 lines...]
Java HotSpot(TM) 64-Bit Server VM warning: ignoring option MaxPermSize=768m; support was removed
in 8.0
Running org.apache.hadoop.yarn.server.resourcemanager.TestRMRestart
Tests run: 56, Failures: 0, Errors: 0, Skipped: 0, Time elapsed: 460.67 sec - in org.apache.hadoop.yarn.server.resourcemanager.TestRMRestart

Results :

Failed tests: 
  TestFifoScheduler.testResourceOverCommit:1142 expected:<-2048> but was:<0>

Tests run: 1343, Failures: 1, Errors: 0, Skipped: 2

[INFO] ------------------------------------------------------------------------
[INFO] Reactor Summary:
[INFO] 
[INFO] Apache Hadoop YARN ................................ SUCCESS [  5.140 s]
[INFO] Apache Hadoop YARN API ............................ SUCCESS [01:43 min]
[INFO] Apache Hadoop YARN Common ......................... SUCCESS [02:55 min]
[INFO] Apache Hadoop YARN Server ......................... SUCCESS [  0.079 s]
[INFO] Apache Hadoop YARN Server Common .................. SUCCESS [ 51.304 s]
[INFO] Apache Hadoop YARN NodeManager .................... SUCCESS [10:34 min]
[INFO] Apache Hadoop YARN Web Proxy ...................... SUCCESS [ 22.199 s]
[INFO] Apache Hadoop YARN ApplicationHistoryService ...... SUCCESS [03:46 min]
[INFO] Apache Hadoop YARN ResourceManager ................ FAILURE [  01:06 h]
[INFO] Apache Hadoop YARN Server Tests ................... SKIPPED
[INFO] Apache Hadoop YARN Client ......................... SKIPPED
[INFO] Apache Hadoop YARN SharedCacheManager ............. SKIPPED
[INFO] Apache Hadoop YARN Timeline Plugin Storage ........ SKIPPED
[INFO] Apache Hadoop YARN Applications ................... SKIPPED
[INFO] Apache Hadoop YARN DistributedShell ............... SKIPPED
[INFO] Apache Hadoop YARN Unmanaged Am Launcher .......... SKIPPED
[INFO] Apache Hadoop YARN Site ........................... SKIPPED
[INFO] Apache Hadoop YARN Registry ....................... SKIPPED
[INFO] Apache Hadoop YARN Project ........................ SKIPPED
[INFO] ------------------------------------------------------------------------
[INFO] BUILD FAILURE
[INFO] ------------------------------------------------------------------------
[INFO] Total time: 01:27 h
[INFO] Finished at: 2016-02-08T20:10:56+00:00
[INFO] Final Memory: 63M/1136M
[INFO] ------------------------------------------------------------------------
[ERROR] Failed to execute goal org.apache.maven.plugins:maven-surefire-plugin:2.17:test (default-test)
on project hadoop-yarn-server-resourcemanager: There are test failures.
[ERROR] 
[ERROR] Please refer to /home/jenkins/jenkins-slave/workspace/Hadoop-Yarn-trunk-Java8/hadoop-yarn-project/hadoop-yarn/hadoop-yarn-server/hadoop-yarn-server-resourcemanager/target/surefire-reports
for the individual test results.
[ERROR] -> [Help 1]
[ERROR] 
[ERROR] To see the full stack trace of the errors, re-run Maven with the -e switch.
[ERROR] Re-run Maven using the -X switch to enable full debug logging.
[ERROR] 
[ERROR] For more information about the errors and possible solutions, please read the following
articles:
[ERROR] [Help 1] http://cwiki.apache.org/confluence/display/MAVEN/MojoFailureException
[ERROR] 
[ERROR] After correcting the problems, you can resume the build with the command
[ERROR]   mvn <goals> -rf :hadoop-yarn-server-resourcemanager
Build step 'Execute shell' marked build as failure
Archiving artifacts
Recording test results
Sending e-mails to: yarn-dev@hadoop.apache.org
Email was triggered for: Failure - Any
Sending email for trigger: Failure - Any



###################################################################################
############################## FAILED TESTS (if any) ##############################
1 tests failed.
FAILED:  org.apache.hadoop.yarn.server.resourcemanager.scheduler.fifo.TestFifoScheduler.testResourceOverCommit

Error Message:
expected:<-2048> but was:<0>

Stack Trace:
java.lang.AssertionError: expected:<-2048> but was:<0>
	at org.junit.Assert.fail(Assert.java:88)
	at org.junit.Assert.failNotEquals(Assert.java:743)
	at org.junit.Assert.assertEquals(Assert.java:118)
	at org.junit.Assert.assertEquals(Assert.java:555)
	at org.junit.Assert.assertEquals(Assert.java:542)
	at org.apache.hadoop.yarn.server.resourcemanager.scheduler.fifo.TestFifoScheduler.testResourceOverCommit(TestFifoScheduler.java:1142)



Mime
  • Unnamed multipart/mixed (inline, None, 0 bytes)
View raw message