hadoop-yarn-dev mailing list archives

Site index · List index
Message view « Date » · « Thread »
Top « Date » · « Thread »
From Apache Jenkins Server <jenk...@builds.apache.org>
Subject Build failed in Jenkins: Hadoop-Yarn-trunk-Java8 #995
Date Mon, 01 Feb 2016 20:45:45 GMT
See <https://builds.apache.org/job/Hadoop-Yarn-trunk-Java8/995/changes>

Changes:

[xyao] HDFS-9210. Fix some misuse of %n in VolumeScanner#printStats.

------------------------------------------
[...truncated 4061 lines...]
Tests run: 1, Failures: 0, Errors: 0, Skipped: 0, Time elapsed: 0.25 sec - in org.apache.hadoop.yarn.TestContainerLogAppender
Java HotSpot(TM) 64-Bit Server VM warning: ignoring option MaxPermSize=768m; support was removed
in 8.0
Running org.apache.hadoop.yarn.TestRPCFactories
Tests run: 1, Failures: 0, Errors: 0, Skipped: 0, Time elapsed: 0.716 sec - in org.apache.hadoop.yarn.TestRPCFactories
Java HotSpot(TM) 64-Bit Server VM warning: ignoring option MaxPermSize=768m; support was removed
in 8.0
Running org.apache.hadoop.yarn.TestYarnUncaughtExceptionHandler
Exception: org.apache.hadoop.util.ExitUtil$ExitException thrown from the UncaughtExceptionHandler
in thread "Thread-0"
Exception: org.apache.hadoop.util.ExitUtil$HaltException thrown from the UncaughtExceptionHandler
in thread "Thread-3"
Tests run: 3, Failures: 0, Errors: 0, Skipped: 0, Time elapsed: 0.373 sec - in org.apache.hadoop.yarn.TestYarnUncaughtExceptionHandler
Java HotSpot(TM) 64-Bit Server VM warning: ignoring option MaxPermSize=768m; support was removed
in 8.0
Running org.apache.hadoop.yarn.event.TestAsyncDispatcher
Tests run: 2, Failures: 0, Errors: 0, Skipped: 0, Time elapsed: 2.668 sec - in org.apache.hadoop.yarn.event.TestAsyncDispatcher
Java HotSpot(TM) 64-Bit Server VM warning: ignoring option MaxPermSize=768m; support was removed
in 8.0
Running org.apache.hadoop.yarn.conf.TestHAUtil
Tests run: 4, Failures: 0, Errors: 0, Skipped: 0, Time elapsed: 0.532 sec - in org.apache.hadoop.yarn.conf.TestHAUtil
Java HotSpot(TM) 64-Bit Server VM warning: ignoring option MaxPermSize=768m; support was removed
in 8.0
Running org.apache.hadoop.yarn.conf.TestYarnConfiguration
Tests run: 5, Failures: 0, Errors: 0, Skipped: 0, Time elapsed: 0.831 sec - in org.apache.hadoop.yarn.conf.TestYarnConfiguration
Java HotSpot(TM) 64-Bit Server VM warning: ignoring option MaxPermSize=768m; support was removed
in 8.0
Running org.apache.hadoop.yarn.TestRpcFactoryProvider
Tests run: 1, Failures: 0, Errors: 0, Skipped: 0, Time elapsed: 0.347 sec - in org.apache.hadoop.yarn.TestRpcFactoryProvider
Java HotSpot(TM) 64-Bit Server VM warning: ignoring option MaxPermSize=768m; support was removed
in 8.0
Running org.apache.hadoop.yarn.TestRecordFactory
Tests run: 1, Failures: 0, Errors: 0, Skipped: 0, Time elapsed: 0.268 sec - in org.apache.hadoop.yarn.TestRecordFactory
Java HotSpot(TM) 64-Bit Server VM warning: ignoring option MaxPermSize=768m; support was removed
in 8.0
Running org.apache.hadoop.yarn.webapp.TestWebApp
Tests run: 9, Failures: 0, Errors: 9, Skipped: 0, Time elapsed: 0.799 sec <<< FAILURE!
- in org.apache.hadoop.yarn.webapp.TestWebApp
testYARNWebAppContext(org.apache.hadoop.yarn.webapp.TestWebApp)  Time elapsed: 0.468 sec 
<<< ERROR!
java.lang.NoClassDefFoundError: org/apache/hadoop/http/NoCacheFilter
	at java.net.URLClassLoader$1.run(URLClassLoader.java:372)
	at java.net.URLClassLoader$1.run(URLClassLoader.java:361)
	at java.security.AccessController.doPrivileged(Native Method)
	at java.net.URLClassLoader.findClass(URLClassLoader.java:360)
	at java.lang.ClassLoader.loadClass(ClassLoader.java:424)
	at sun.misc.Launcher$AppClassLoader.loadClass(Launcher.java:308)
	at java.lang.ClassLoader.loadClass(ClassLoader.java:357)
	at org.apache.hadoop.http.HttpServer2.addNoCacheFilter(HttpServer2.java:462)
	at org.apache.hadoop.http.HttpServer2.createWebAppContext(HttpServer2.java:438)
	at org.apache.hadoop.http.HttpServer2.<init>(HttpServer2.java:338)
	at org.apache.hadoop.http.HttpServer2.<init>(HttpServer2.java:115)
	at org.apache.hadoop.http.HttpServer2$Builder.build(HttpServer2.java:291)
	at org.apache.hadoop.yarn.webapp.WebApps$Builder.build(WebApps.java:261)
	at org.apache.hadoop.yarn.webapp.WebApps$Builder.start(WebApps.java:303)
	at org.apache.hadoop.yarn.webapp.TestWebApp.testYARNWebAppContext(TestWebApp.java:268)

testDefaultRoutes(org.apache.hadoop.yarn.webapp.TestWebApp)  Time elapsed: 0.031 sec  <<<
ERROR!
java.lang.NoClassDefFoundError: org/apache/hadoop/http/NoCacheFilter
	at org.apache.hadoop.http.HttpServer2.addNoCacheFilter(HttpServer2.java:462)
	at org.apache.hadoop.http.HttpServer2.createWebAppContext(HttpServer2.java:438)
	at org.apache.hadoop.http.HttpServer2.<init>(HttpServer2.java:338)
	at org.apache.hadoop.http.HttpServer2.<init>(HttpServer2.java:115)
	at org.apache.hadoop.http.HttpServer2$Builder.build(HttpServer2.java:291)
	at org.apache.hadoop.yarn.webapp.WebApps$Builder.build(WebApps.java:261)
	at org.apache.hadoop.yarn.webapp.WebApps$Builder.start(WebApps.java:303)
	at org.apache.hadoop.yarn.webapp.WebApps$Builder.start(WebApps.java:299)
	at org.apache.hadoop.yarn.webapp.TestWebApp.testDefaultRoutes(TestWebApp.java:218)

testCreateWithBindAddressNonZeroPort(org.apache.hadoop.yarn.webapp.TestWebApp)  Time elapsed:
0.027 sec  <<< ERROR!
java.lang.Exception: Unexpected exception, expected<org.apache.hadoop.yarn.webapp.WebAppException>
but was<java.lang.NoClassDefFoundError>
	at org.apache.hadoop.http.HttpServer2.addNoCacheFilter(HttpServer2.java:462)
	at org.apache.hadoop.http.HttpServer2.createWebAppContext(HttpServer2.java:438)
	at org.apache.hadoop.http.HttpServer2.<init>(HttpServer2.java:338)
	at org.apache.hadoop.http.HttpServer2.<init>(HttpServer2.java:115)
	at org.apache.hadoop.http.HttpServer2$Builder.build(HttpServer2.java:291)
	at org.apache.hadoop.yarn.webapp.WebApps$Builder.build(WebApps.java:261)
	at org.apache.hadoop.yarn.webapp.WebApps$Builder.start(WebApps.java:303)
	at org.apache.hadoop.yarn.webapp.WebApps$Builder.start(WebApps.java:299)
	at org.apache.hadoop.yarn.webapp.TestWebApp.testCreateWithBindAddressNonZeroPort(TestWebApp.java:169)

testCreateWithPort(org.apache.hadoop.yarn.webapp.TestWebApp)  Time elapsed: 0.017 sec  <<<
ERROR!
java.lang.NoClassDefFoundError: org/apache/hadoop/http/NoCacheFilter
	at org.apache.hadoop.http.HttpServer2.addNoCacheFilter(HttpServer2.java:462)
	at org.apache.hadoop.http.HttpServer2.createWebAppContext(HttpServer2.java:438)
	at org.apache.hadoop.http.HttpServer2.<init>(HttpServer2.java:338)
	at org.apache.hadoop.http.HttpServer2.<init>(HttpServer2.java:115)
	at org.apache.hadoop.http.HttpServer2$Builder.build(HttpServer2.java:291)
	at org.apache.hadoop.yarn.webapp.WebApps$Builder.build(WebApps.java:261)
	at org.apache.hadoop.yarn.webapp.WebApps$Builder.start(WebApps.java:303)
	at org.apache.hadoop.yarn.webapp.WebApps$Builder.start(WebApps.java:299)
	at org.apache.hadoop.yarn.webapp.TestWebApp.testCreateWithPort(TestWebApp.java:157)

testCreateWithNonZeroPort(org.apache.hadoop.yarn.webapp.TestWebApp)  Time elapsed: 0.016 sec
 <<< ERROR!
java.lang.Exception: Unexpected exception, expected<org.apache.hadoop.yarn.webapp.WebAppException>
but was<java.lang.NoClassDefFoundError>
	at org.apache.hadoop.http.HttpServer2.addNoCacheFilter(HttpServer2.java:462)
	at org.apache.hadoop.http.HttpServer2.createWebAppContext(HttpServer2.java:438)
	at org.apache.hadoop.http.HttpServer2.<init>(HttpServer2.java:338)
	at org.apache.hadoop.http.HttpServer2.<init>(HttpServer2.java:115)
	at org.apache.hadoop.http.HttpServer2$Builder.build(HttpServer2.java:291)
	at org.apache.hadoop.yarn.webapp.WebApps$Builder.build(WebApps.java:261)
	at org.apache.hadoop.yarn.webapp.WebApps$Builder.start(WebApps.java:303)
	at org.apache.hadoop.yarn.webapp.WebApps$Builder.start(WebApps.java:299)
	at org.apache.hadoop.yarn.webapp.TestWebApp.testCreateWithNonZeroPort(TestWebApp.java:181)

testServePathsNoName(org.apache.hadoop.yarn.webapp.TestWebApp)  Time elapsed: 0.016 sec  <<<
ERROR!
java.lang.NoClassDefFoundError: org/apache/hadoop/http/NoCacheFilter
	at org.apache.hadoop.http.HttpServer2.addNoCacheFilter(HttpServer2.java:462)
	at org.apache.hadoop.http.HttpServer2.createWebAppContext(HttpServer2.java:438)
	at org.apache.hadoop.http.HttpServer2.<init>(HttpServer2.java:338)
	at org.apache.hadoop.http.HttpServer2.<init>(HttpServer2.java:115)
	at org.apache.hadoop.http.HttpServer2$Builder.build(HttpServer2.java:291)
	at org.apache.hadoop.yarn.webapp.WebApps$Builder.build(WebApps.java:261)
	at org.apache.hadoop.yarn.webapp.WebApps$Builder.start(WebApps.java:303)
	at org.apache.hadoop.yarn.webapp.WebApps$Builder.start(WebApps.java:299)
	at org.apache.hadoop.yarn.webapp.TestWebApp.testServePathsNoName(TestWebApp.java:205)

testCreate(org.apache.hadoop.yarn.webapp.TestWebApp)  Time elapsed: 0.017 sec  <<<
ERROR!
java.lang.NoClassDefFoundError: org/apache/hadoop/http/NoCacheFilter
	at org.apache.hadoop.http.HttpServer2.addNoCacheFilter(HttpServer2.java:462)
	at org.apache.hadoop.http.HttpServer2.createWebAppContext(HttpServer2.java:438)
	at org.apache.hadoop.http.HttpServer2.<init>(HttpServer2.java:338)
	at org.apache.hadoop.http.HttpServer2.<init>(HttpServer2.java:115)
	at org.apache.hadoop.http.HttpServer2$Builder.build(HttpServer2.java:291)
	at org.apache.hadoop.yarn.webapp.WebApps$Builder.build(WebApps.java:261)
	at org.apache.hadoop.yarn.webapp.WebApps$Builder.start(WebApps.java:303)
	at org.apache.hadoop.yarn.webapp.WebApps$Builder.start(WebApps.java:299)
	at org.apache.hadoop.yarn.webapp.TestWebApp.testCreate(TestWebApp.java:151)

testCustomRoutes(org.apache.hadoop.yarn.webapp.TestWebApp)  Time elapsed: 0.017 sec  <<<
ERROR!
java.lang.NoClassDefFoundError: org/apache/hadoop/http/NoCacheFilter
	at org.apache.hadoop.http.HttpServer2.addNoCacheFilter(HttpServer2.java:462)
	at org.apache.hadoop.http.HttpServer2.createWebAppContext(HttpServer2.java:438)
	at org.apache.hadoop.http.HttpServer2.<init>(HttpServer2.java:338)
	at org.apache.hadoop.http.HttpServer2.<init>(HttpServer2.java:115)
	at org.apache.hadoop.http.HttpServer2$Builder.build(HttpServer2.java:291)
	at org.apache.hadoop.yarn.webapp.WebApps$Builder.build(WebApps.java:261)
	at org.apache.hadoop.yarn.webapp.WebApps$Builder.start(WebApps.java:303)
	at org.apache.hadoop.yarn.webapp.TestWebApp.testCustomRoutes(TestWebApp.java:234)

testServePaths(org.apache.hadoop.yarn.webapp.TestWebApp)  Time elapsed: 0.011 sec  <<<
ERROR!
java.lang.NoClassDefFoundError: org/apache/hadoop/http/NoCacheFilter
	at org.apache.hadoop.http.HttpServer2.addNoCacheFilter(HttpServer2.java:462)
	at org.apache.hadoop.http.HttpServer2.createWebAppContext(HttpServer2.java:438)
	at org.apache.hadoop.http.HttpServer2.<init>(HttpServer2.java:338)
	at org.apache.hadoop.http.HttpServer2.<init>(HttpServer2.java:115)
	at org.apache.hadoop.http.HttpServer2$Builder.build(HttpServer2.java:291)
	at org.apache.hadoop.yarn.webapp.WebApps$Builder.build(WebApps.java:261)
	at org.apache.hadoop.yarn.webapp.WebApps$Builder.start(WebApps.java:303)
	at org.apache.hadoop.yarn.webapp.WebApps$Builder.start(WebApps.java:299)
	at org.apache.hadoop.yarn.webapp.TestWebApp.testServePaths(TestWebApp.java:192)

Java HotSpot(TM) 64-Bit Server VM warning: ignoring option MaxPermSize=768m; support was removed
in 8.0
Running org.apache.hadoop.yarn.webapp.hamlet.TestHamletImpl
Tests run: 4, Failures: 0, Errors: 0, Skipped: 0, Time elapsed: 0.465 sec - in org.apache.hadoop.yarn.webapp.hamlet.TestHamletImpl
Java HotSpot(TM) 64-Bit Server VM warning: ignoring option MaxPermSize=768m; support was removed
in 8.0
Running org.apache.hadoop.yarn.webapp.hamlet.TestHamlet
Tests run: 6, Failures: 0, Errors: 0, Skipped: 0, Time elapsed: 0.538 sec - in org.apache.hadoop.yarn.webapp.hamlet.TestHamlet
Java HotSpot(TM) 64-Bit Server VM warning: ignoring option MaxPermSize=768m; support was removed
in 8.0
Running org.apache.hadoop.yarn.webapp.hamlet.TestParseSelector
Tests run: 5, Failures: 0, Errors: 0, Skipped: 0, Time elapsed: 0.134 sec - in org.apache.hadoop.yarn.webapp.hamlet.TestParseSelector
Java HotSpot(TM) 64-Bit Server VM warning: ignoring option MaxPermSize=768m; support was removed
in 8.0
Running org.apache.hadoop.yarn.webapp.TestSubViews
Tests run: 1, Failures: 0, Errors: 0, Skipped: 0, Time elapsed: 0.769 sec - in org.apache.hadoop.yarn.webapp.TestSubViews
Java HotSpot(TM) 64-Bit Server VM warning: ignoring option MaxPermSize=768m; support was removed
in 8.0
Running org.apache.hadoop.yarn.webapp.util.TestWebAppUtils
Tests run: 3, Failures: 0, Errors: 0, Skipped: 0, Time elapsed: 1.007 sec - in org.apache.hadoop.yarn.webapp.util.TestWebAppUtils
Java HotSpot(TM) 64-Bit Server VM warning: ignoring option MaxPermSize=768m; support was removed
in 8.0
Running org.apache.hadoop.yarn.webapp.TestParseRoute
Tests run: 10, Failures: 0, Errors: 0, Skipped: 0, Time elapsed: 0.194 sec - in org.apache.hadoop.yarn.webapp.TestParseRoute
Java HotSpot(TM) 64-Bit Server VM warning: ignoring option MaxPermSize=768m; support was removed
in 8.0
Running org.apache.hadoop.yarn.webapp.test.TestWebAppTests
Tests run: 4, Failures: 0, Errors: 0, Skipped: 0, Time elapsed: 0.566 sec - in org.apache.hadoop.yarn.webapp.test.TestWebAppTests
Java HotSpot(TM) 64-Bit Server VM warning: ignoring option MaxPermSize=768m; support was removed
in 8.0
Running org.apache.hadoop.yarn.webapp.view.TestInfoBlock
Tests run: 2, Failures: 0, Errors: 0, Skipped: 0, Time elapsed: 0.822 sec - in org.apache.hadoop.yarn.webapp.view.TestInfoBlock
Java HotSpot(TM) 64-Bit Server VM warning: ignoring option MaxPermSize=768m; support was removed
in 8.0
Running org.apache.hadoop.yarn.webapp.view.TestTwoColumnCssPage
Tests run: 1, Failures: 0, Errors: 0, Skipped: 0, Time elapsed: 1.019 sec - in org.apache.hadoop.yarn.webapp.view.TestTwoColumnCssPage
Java HotSpot(TM) 64-Bit Server VM warning: ignoring option MaxPermSize=768m; support was removed
in 8.0
Running org.apache.hadoop.yarn.webapp.view.TestTwoColumnLayout
Tests run: 1, Failures: 0, Errors: 0, Skipped: 0, Time elapsed: 1.153 sec - in org.apache.hadoop.yarn.webapp.view.TestTwoColumnLayout
Java HotSpot(TM) 64-Bit Server VM warning: ignoring option MaxPermSize=768m; support was removed
in 8.0
Running org.apache.hadoop.yarn.webapp.view.TestHtmlBlock
Tests run: 3, Failures: 0, Errors: 0, Skipped: 0, Time elapsed: 0.8 sec - in org.apache.hadoop.yarn.webapp.view.TestHtmlBlock
Java HotSpot(TM) 64-Bit Server VM warning: ignoring option MaxPermSize=768m; support was removed
in 8.0
Running org.apache.hadoop.yarn.webapp.view.TestCommonViews
Tests run: 5, Failures: 0, Errors: 0, Skipped: 0, Time elapsed: 0.891 sec - in org.apache.hadoop.yarn.webapp.view.TestCommonViews
Java HotSpot(TM) 64-Bit Server VM warning: ignoring option MaxPermSize=768m; support was removed
in 8.0
Running org.apache.hadoop.yarn.webapp.view.TestHtmlPage
Tests run: 2, Failures: 0, Errors: 0, Skipped: 0, Time elapsed: 0.797 sec - in org.apache.hadoop.yarn.webapp.view.TestHtmlPage
Java HotSpot(TM) 64-Bit Server VM warning: ignoring option MaxPermSize=768m; support was removed
in 8.0
Running org.apache.hadoop.yarn.logaggregation.TestAggregatedLogsBlock
Tests run: 5, Failures: 0, Errors: 0, Skipped: 0, Time elapsed: 1.35 sec - in org.apache.hadoop.yarn.logaggregation.TestAggregatedLogsBlock
Java HotSpot(TM) 64-Bit Server VM warning: ignoring option MaxPermSize=768m; support was removed
in 8.0
Running org.apache.hadoop.yarn.logaggregation.TestAggregatedLogFormat
Tests run: 3, Failures: 0, Errors: 0, Skipped: 1, Time elapsed: 1.166 sec - in org.apache.hadoop.yarn.logaggregation.TestAggregatedLogFormat
Java HotSpot(TM) 64-Bit Server VM warning: ignoring option MaxPermSize=768m; support was removed
in 8.0
Running org.apache.hadoop.yarn.logaggregation.TestAggregatedLogDeletionService
Tests run: 3, Failures: 0, Errors: 0, Skipped: 0, Time elapsed: 2.999 sec - in org.apache.hadoop.yarn.logaggregation.TestAggregatedLogDeletionService

Results :

Tests in error: 
  TestWebApp.testYARNWebAppContext:268 » NoClassDefFound org/apache/hadoop/http/...
  TestWebApp.testDefaultRoutes:218 » NoClassDefFound org/apache/hadoop/http/NoCa...
  TestWebApp.testCreateWithBindAddressNonZeroPort »  Unexpected exception, expec...
  TestWebApp.testCreateWithPort:157 » NoClassDefFound org/apache/hadoop/http/NoC...
  TestWebApp.testCreateWithNonZeroPort »  Unexpected exception, expected<org.apa...
  TestWebApp.testServePathsNoName:205 » NoClassDefFound org/apache/hadoop/http/N...
  TestWebApp.testCreate:151 » NoClassDefFound org/apache/hadoop/http/NoCacheFilt...
  TestWebApp.testCustomRoutes:234 » NoClassDefFound org/apache/hadoop/http/NoCac...
  TestWebApp.testServePaths:192 » NoClassDefFound org/apache/hadoop/http/NoCache...

Tests run: 336, Failures: 0, Errors: 9, Skipped: 7

[INFO] ------------------------------------------------------------------------
[INFO] Reactor Summary:
[INFO] 
[INFO] Apache Hadoop YARN ................................ SUCCESS [  3.054 s]
[INFO] Apache Hadoop YARN API ............................ SUCCESS [01:24 min]
[INFO] Apache Hadoop YARN Common ......................... FAILURE [01:37 min]
[INFO] Apache Hadoop YARN Server ......................... SKIPPED
[INFO] Apache Hadoop YARN Server Common .................. SKIPPED
[INFO] Apache Hadoop YARN NodeManager .................... SKIPPED
[INFO] Apache Hadoop YARN Web Proxy ...................... SKIPPED
[INFO] Apache Hadoop YARN ApplicationHistoryService ...... SKIPPED
[INFO] Apache Hadoop YARN ResourceManager ................ SKIPPED
[INFO] Apache Hadoop YARN Server Tests ................... SKIPPED
[INFO] Apache Hadoop YARN Client ......................... SKIPPED
[INFO] Apache Hadoop YARN SharedCacheManager ............. SKIPPED
[INFO] Apache Hadoop YARN Timeline Plugin Storage ........ SKIPPED
[INFO] Apache Hadoop YARN Applications ................... SKIPPED
[INFO] Apache Hadoop YARN DistributedShell ............... SKIPPED
[INFO] Apache Hadoop YARN Unmanaged Am Launcher .......... SKIPPED
[INFO] Apache Hadoop YARN Site ........................... SKIPPED
[INFO] Apache Hadoop YARN Registry ....................... SKIPPED
[INFO] Apache Hadoop YARN Project ........................ SKIPPED
[INFO] ------------------------------------------------------------------------
[INFO] BUILD FAILURE
[INFO] ------------------------------------------------------------------------
[INFO] Total time: 03:06 min
[INFO] Finished at: 2016-02-01T20:45:43+00:00
[INFO] Final Memory: 74M/1057M
[INFO] ------------------------------------------------------------------------
[ERROR] Failed to execute goal org.apache.maven.plugins:maven-surefire-plugin:2.17:test (default-test)
on project hadoop-yarn-common: There are test failures.
[ERROR] 
[ERROR] Please refer to <https://builds.apache.org/job/Hadoop-Yarn-trunk-Java8/ws/hadoop-yarn-project/hadoop-yarn/hadoop-yarn-common/target/surefire-reports>
for the individual test results.
[ERROR] -> [Help 1]
[ERROR] 
[ERROR] To see the full stack trace of the errors, re-run Maven with the -e switch.
[ERROR] Re-run Maven using the -X switch to enable full debug logging.
[ERROR] 
[ERROR] For more information about the errors and possible solutions, please read the following
articles:
[ERROR] [Help 1] http://cwiki.apache.org/confluence/display/MAVEN/MojoFailureException
[ERROR] 
[ERROR] After correcting the problems, you can resume the build with the command
[ERROR]   mvn <goals> -rf :hadoop-yarn-common
Build step 'Execute shell' marked build as failure
Archiving artifacts
Recording test results

Mime
View raw message