hadoop-yarn-dev mailing list archives

Site index · List index
Message view « Date » · « Thread »
Top « Date » · « Thread »
From "Rohith Sharma K S (JIRA)" <j...@apache.org>
Subject [jira] [Resolved] (YARN-4317) Test failure: TestResourceTrackerService
Date Fri, 22 Jan 2016 16:04:39 GMT

     [ https://issues.apache.org/jira/browse/YARN-4317?page=com.atlassian.jira.plugin.system.issuetabpanels:all-tabpanel
]

Rohith Sharma K S resolved YARN-4317.
-------------------------------------
    Resolution: Cannot Reproduce

Closing the JIRA as not reproducible, feel free to reopen if issue is still exist and reproducible.

> Test failure: TestResourceTrackerService 
> -----------------------------------------
>
>                 Key: YARN-4317
>                 URL: https://issues.apache.org/jira/browse/YARN-4317
>             Project: Hadoop YARN
>          Issue Type: Sub-task
>            Reporter: Tsuyoshi Ozawa
>
> {quote}
> Running org.apache.hadoop.yarn.server.resourcemanager.TestResourceTrackerService
> Tests run: 14, Failures: 1, Errors: 0, Skipped: 0, Time elapsed: 8.438 sec <<<
FAILURE! - in org.apache.hadoop.yarn.server.resourcemanager.TestResourceTrackerService
> testReconnectNode(org.apache.hadoop.yarn.server.resourcemanager.TestResourceTrackerService)
 Time elapsed: 0.114 sec  <<< FAILURE!
> java.lang.AssertionError: expected:<15360> but was:<10240>
> 	at org.junit.Assert.fail(Assert.java:88)
> 	at org.junit.Assert.failNotEquals(Assert.java:743)
> 	at org.junit.Assert.assertEquals(Assert.java:118)
> 	at org.junit.Assert.assertEquals(Assert.java:555)
> 	at org.junit.Assert.assertEquals(Assert.java:542)
> 	at org.apache.hadoop.yarn.server.resourcemanager.TestResourceTrackerService.testReconnectNode(TestResourceTrackerService.java:624)
> {quote}



--
This message was sent by Atlassian JIRA
(v6.3.4#6332)

Mime
View raw message