hadoop-yarn-dev mailing list archives

Site index · List index
Message view « Date » · « Thread »
Top « Date » · « Thread »
From Apache Jenkins Server <jenk...@builds.apache.org>
Subject Hadoop-Yarn-trunk-Java8 - Build # 864 - Still Failing
Date Tue, 05 Jan 2016 21:05:08 GMT
See https://builds.apache.org/job/Hadoop-Yarn-trunk-Java8/864/

###################################################################################
########################## LAST 60 LINES OF THE CONSOLE ###########################
[...truncated 5501 lines...]
Tests run: 21, Failures: 0, Errors: 0, Skipped: 0, Time elapsed: 17.144 sec - in org.apache.hadoop.yarn.server.resourcemanager.TestRMAdminService
Java HotSpot(TM) 64-Bit Server VM warning: ignoring option MaxPermSize=768m; support was removed
in 8.0
Running org.apache.hadoop.yarn.server.resourcemanager.TestRMAuditLogger
Tests run: 3, Failures: 0, Errors: 0, Skipped: 0, Time elapsed: 1.254 sec - in org.apache.hadoop.yarn.server.resourcemanager.TestRMAuditLogger

Results :

Tests in error: 
  TestSubmitApplicationWithRMHA.testHandleRMHADuringSubmitApplicationCallWithoutSavedApplicationState:284->RMHATestBase.explicitFailover:183->Object.wait:-2
ยป 

Tests run: 1295, Failures: 0, Errors: 1, Skipped: 2

[INFO] ------------------------------------------------------------------------
[INFO] Reactor Summary:
[INFO] 
[INFO] Apache Hadoop YARN ................................ SUCCESS [  3.720 s]
[INFO] Apache Hadoop YARN API ............................ SUCCESS [01:19 min]
[INFO] Apache Hadoop YARN Common ......................... SUCCESS [03:01 min]
[INFO] Apache Hadoop YARN Server ......................... SUCCESS [  0.103 s]
[INFO] Apache Hadoop YARN Server Common .................. SUCCESS [ 51.406 s]
[INFO] Apache Hadoop YARN NodeManager .................... SUCCESS [09:57 min]
[INFO] Apache Hadoop YARN Web Proxy ...................... SUCCESS [ 16.852 s]
[INFO] Apache Hadoop YARN ApplicationHistoryService ...... SUCCESS [03:53 min]
[INFO] Apache Hadoop YARN ResourceManager ................ FAILURE [  01:07 h]
[INFO] Apache Hadoop YARN Server Tests ................... SKIPPED
[INFO] Apache Hadoop YARN Client ......................... SKIPPED
[INFO] Apache Hadoop YARN SharedCacheManager ............. SKIPPED
[INFO] Apache Hadoop YARN Applications ................... SKIPPED
[INFO] Apache Hadoop YARN DistributedShell ............... SKIPPED
[INFO] Apache Hadoop YARN Unmanaged Am Launcher .......... SKIPPED
[INFO] Apache Hadoop YARN Site ........................... SKIPPED
[INFO] Apache Hadoop YARN Registry ....................... SKIPPED
[INFO] Apache Hadoop YARN Project ........................ SKIPPED
[INFO] ------------------------------------------------------------------------
[INFO] BUILD FAILURE
[INFO] ------------------------------------------------------------------------
[INFO] Total time: 01:27 h
[INFO] Finished at: 2016-01-05T21:05:05+00:00
[INFO] Final Memory: 60M/720M
[INFO] ------------------------------------------------------------------------
[ERROR] Failed to execute goal org.apache.maven.plugins:maven-surefire-plugin:2.17:test (default-test)
on project hadoop-yarn-server-resourcemanager: There are test failures.
[ERROR] 
[ERROR] Please refer to /home/jenkins/jenkins-slave/workspace/Hadoop-Yarn-trunk-Java8/hadoop-yarn-project/hadoop-yarn/hadoop-yarn-server/hadoop-yarn-server-resourcemanager/target/surefire-reports
for the individual test results.
[ERROR] -> [Help 1]
[ERROR] 
[ERROR] To see the full stack trace of the errors, re-run Maven with the -e switch.
[ERROR] Re-run Maven using the -X switch to enable full debug logging.
[ERROR] 
[ERROR] For more information about the errors and possible solutions, please read the following
articles:
[ERROR] [Help 1] http://cwiki.apache.org/confluence/display/MAVEN/MojoFailureException
[ERROR] 
[ERROR] After correcting the problems, you can resume the build with the command
[ERROR]   mvn <goals> -rf :hadoop-yarn-server-resourcemanager
Build step 'Execute shell' marked build as failure
Archiving artifacts
Recording test results
Sending e-mails to: yarn-dev@hadoop.apache.org
Email was triggered for: Failure - Any
Sending email for trigger: Failure - Any



###################################################################################
############################## FAILED TESTS (if any) ##############################
1 tests failed.
FAILED:  org.apache.hadoop.yarn.server.resourcemanager.TestSubmitApplicationWithRMHA.testHandleRMHADuringSubmitApplicationCallWithoutSavedApplicationState

Error Message:
test timed out after 5000 milliseconds

Stack Trace:
java.lang.Exception: test timed out after 5000 milliseconds
	at java.lang.Object.wait(Native Method)
	at java.lang.Thread.join(Thread.java:1244)
	at java.lang.Thread.join(Thread.java:1318)
	at org.apache.hadoop.security.token.delegation.AbstractDelegationTokenSecretManager.stopThreads(AbstractDelegationTokenSecretManager.java:627)
	at org.apache.hadoop.yarn.server.resourcemanager.RMSecretManagerService.serviceStop(RMSecretManagerService.java:93)
	at org.apache.hadoop.service.AbstractService.stop(AbstractService.java:221)
	at org.apache.hadoop.service.ServiceOperations.stop(ServiceOperations.java:52)
	at org.apache.hadoop.service.ServiceOperations.stopQuietly(ServiceOperations.java:80)
	at org.apache.hadoop.service.CompositeService.stop(CompositeService.java:157)
	at org.apache.hadoop.service.CompositeService.serviceStop(CompositeService.java:131)
	at org.apache.hadoop.yarn.server.resourcemanager.ResourceManager$RMActiveServices.serviceStop(ResourceManager.java:602)
	at org.apache.hadoop.service.AbstractService.stop(AbstractService.java:221)
	at org.apache.hadoop.yarn.server.resourcemanager.ResourceManager.stopActiveServices(ResourceManager.java:1021)
	at org.apache.hadoop.yarn.server.resourcemanager.ResourceManager.transitionToStandby(ResourceManager.java:1077)
	at org.apache.hadoop.yarn.server.resourcemanager.AdminService.transitionToStandby(AdminService.java:357)
	at org.apache.hadoop.yarn.server.resourcemanager.RMHATestBase.explicitFailover(RMHATestBase.java:183)
	at org.apache.hadoop.yarn.server.resourcemanager.TestSubmitApplicationWithRMHA.testHandleRMHADuringSubmitApplicationCallWithoutSavedApplicationState(TestSubmitApplicationWithRMHA.java:284)



Mime
  • Unnamed multipart/mixed (inline, None, 0 bytes)
View raw message